program: Orca
programVersion: 5.0.2
elementType: S P O O O O N N C C C C C C C C C C C C C C H H H H H H H H H H H H H H H H H
charge: 0
multiplicity: 1
keywords: wb97x-d3
keywords: def2-TZVPP
keywords: def2/J RIJCOSX
keywords: DEFGRID2
keywords: scfconv7
keywords: smallprint printgap noloewdin
keywords: NOSOSCF
formula: C14H17N2O4PS
InChI: InChI=1/C14H17N2O4PS/c1-3-18-21(22,19-4-2)20-13-10-11-14(17)16(15-13)12-8-6-5-7-9-12/h5-11H,3-4H2,1-2H3
39 atoms
S  1.298814 -1.671548 1.408095
P  2.104141 -0.206765 0.475187
O  1.493845 1.277065 0.851689
O  2.113929 -0.209571 -1.10634
O  3.632196 0.102747 0.77229
O  -3.686465 2.347619 0.268964
N  -1.843041 1.062441 -0.159149
N  -0.542832 0.796585 -0.011127
C  -2.556997 0.053381 -0.867568
C  0.184443 1.565256 0.703265
C  -2.50073 2.149523 0.416093
C  -0.316591 2.727655 1.359594
C  -1.622537 3.001723 1.207065
C  -2.294037 -1.276299 -0.560802
C  -3.474712 0.380975 -1.855252
C  1.402478 -1.173314 -1.899688
C  4.212611 -0.12517 2.065392
C  -2.950428 -2.281237 -1.251857
C  -4.128314 -0.634478 -2.536102
C  -3.871972 -1.964083 -2.238799
C  2.247481 -2.39864 -2.156025
C  4.993695 -1.41781 2.074025
H  0.342784 3.347185 1.952394
H  -2.085997 3.856996 1.678437
H  -1.574064 -1.521269 0.210156
H  -3.679038 1.411894 -2.1007
H  0.460552 -1.434956 -1.416936
H  1.16545 -0.653273 -2.8267
H  4.858422 0.731802 2.255274
H  3.441937 -0.140711 2.839597
H  -2.745113 -3.315072 -1.008233
H  -4.842988 -0.379255 -3.306878
H  -4.388436 -2.749773 -2.773907
H  3.194985 -2.138809 -2.626927
H  2.451548 -2.936283 -1.230554
H  1.713489 -3.075099 -2.823938
H  5.763049 -1.420084 1.302939
H  5.483197 -1.545326 3.039836
H  4.334669 -2.27013 1.915061
totalener: -1693.86097376 hartree
nucrepener: 2225.11667592 hartree
electener: -3918.97764968 hartree
oneelecener: -6748.20334236 hartree
twoeener: 2829.22569267 hartree
kineticenergy: 1688.45759721 hartree
xcener: -126.696385583294 hartree
chargesum: 0.0000000
charge: -0.400856 0.745218 -0.314305 -0.313834 -0.312760 -0.393163 0.044170 -0.234799 0.199632 0.316450 0.293810 -0.145628 -0.152627 -0.236824 -0.157307 0.064232 0.020713 -0.093742 -0.103783 -0.129139 -0.233518 -0.223165 0.137703 0.135404 0.138385 0.119864 0.072691 0.097646 0.095130 0.080883 0.128341 0.125231 0.126201 0.090923 0.079710 0.081875 0.087174 0.080538 0.083525
qa: -0.4009 0.7452 -0.3143 -0.3138 -0.3128 -0.3932 0.0442 -0.2348 0.1996 0.3165 0.2938 -0.1456 -0.1526 -0.2368 -0.1573 0.0642 0.0207 -0.0937 -0.1038 -0.1291 -0.2335 -0.2232 0.1377 0.1354 0.1384 0.1199 0.0727 0.0976 0.0951 0.0809 0.1283 0.1252 0.1262 0.0909 0.0797 0.0819 0.0872 0.0805 0.0835
va: 2.0071 5.4915 2.1833 2.1340 2.1416 2.1218 3.2681 2.9307 3.6778 4.0632 4.2679 3.9248 3.8857 4.0043 4.0701 3.8615 3.8975 3.9475 3.9550 3.9663 3.9365 3.9164 1.0048 1.0083 1.0325 1.0231 1.0154 0.9950 0.9949 1.0121 1.0005 1.0009 0.9992 1.0063 1.0218 1.0111 1.0045 1.0116 1.0221
dispcorr: -0.019987051 hartree
energy: -1693.880960809158
dipole: 10.44624 -9.17961 1.26662 -12.66901 12.68469 0.01568 -5.00727 4.89910 -0.10817
magnitude: 1.27133 au
magnitude: 3.23147 debye
