program: Orca
programVersion: 5.0.2
elementType: Cl S P O O O N N C C C C C C C C C C C C C C H H H H H H H H H H H H H H H H H H
charge: 0
multiplicity: 1
keywords: wb97x-d3
keywords: def2-TZVPP
keywords: def2/J RIJCOSX
keywords: DEFGRID2
keywords: scfconv7
keywords: smallprint printgap noloewdin
keywords: NOSOSCF
formula: C14H18ClN2O3PS
InChI: InChI=1/C14H18ClN2O3PS/c1-3-9-22-21(18,19-4-2)20-14-10-16-17(11-14)13-7-5-12(15)6-8-13/h5-8,10-11H,3-4,9H2,1-2H3
40 atoms
Cl -7.027421 -1.412483 -0.290986
S  3.140935 0.131053 -1.467578
P  3.343932 0.442374 0.563449
O  1.940677 0.10547 1.286456
O  3.368979 2.028042 0.663572
O  4.429127 -0.310107 1.230905
N  -1.395546 0.266521 0.280792
N  -1.033031 1.49306 -0.095206
C  3.53303 -1.658413 -1.57539
C  2.442337 -2.573539 -1.051324
C  0.706393 0.415139 0.7896
C  -2.733317 -0.149573 0.133227
C  -0.366637 -0.433439 0.816487
C  0.242738 1.605717 0.205805
C  1.128041 -2.455692 -1.803012
C  4.576551 2.775054 0.367192
C  -3.225934 -1.206353 0.88909
C  -3.567474 0.513522 -0.759728
C  -4.545639 -1.603065 0.750217
C  -4.890369 0.126465 -0.889567
C  5.40328 2.984892 1.609186
C  -5.372503 -0.930525 -0.134142
H  4.485125 -1.82986 -1.075924
H  3.693448 -1.820249 -2.64264
H  2.82383 -3.594333 -1.140648
H  2.289841 -2.404987 0.01715
H  -0.447772 -1.45238 1.156568
H  0.393241 -3.159603 -1.412233
H  1.262644 -2.671739 -2.864323
H  0.699599 -1.456186 -1.719899
H  0.772401 2.522859 0.003512
H  4.231196 3.722279 -0.042046
H  5.150865 2.26918 -0.412259
H  -2.602958 -1.723541 1.605706
H  -3.19543 1.334227 -1.355471
H  -4.921671 -2.423947 1.344961
H  -5.534157 0.650457 -1.582626
H  6.264715 3.604688 1.359912
H  4.834495 3.498896 2.383714
H  5.775386 2.044385 2.013618
elementType: Cl S P O N C H
totalener: -2079.46592935 hartree
nucrepener: 2267.13413817 hartree
electener: -4346.60006753 hartree
oneelecener: -7365.30904335 hartree
twoeener: 3018.70897582 hartree
cpcmener: -0.03605014 hartree
kineticenergy: 2073.52171499 hartree
xcener: -141.820248791290 hartree
chargesum: -0.0000000
charge: -0.095356 -0.179890 0.823554 -0.345083 -0.346604 -0.638211 0.192951 -0.347811 -0.089405 -0.108482 0.140624 0.190295 -0.135228 -0.075074 -0.275786 0.051938 -0.226988 -0.218318 -0.119911 -0.107244 -0.243761 0.066754 0.128743 0.126603 0.087975 0.068387 0.183882 0.098465 0.100077 0.074949 0.160208 0.108115 0.092524 0.148560 0.146905 0.147841 0.148104 0.097137 0.089848 0.078714
qa: -0.0954 -0.1799 0.8236 -0.3451 -0.3466 -0.6382 0.1930 -0.3478 -0.0894 -0.1085 0.1406 0.1903 -0.1352 -0.0751 -0.2758 0.0519 -0.2270 -0.2183 -0.1199 -0.1072 -0.2438 0.0668 0.1287 0.1266 0.0880 0.0684 0.1839 0.0985 0.1001 0.0749 0.1602 0.1081 0.0925 0.1486 0.1469 0.1478 0.1481 0.0971 0.0898 0.0787
va: 1.2083 2.2823 5.4750 2.0917 2.1048 1.9756 3.3143 2.8908 3.8593 3.8639 3.8723 3.7134 3.9371 4.0382 3.9410 3.8429 4.0346 4.0068 3.9789 3.9762 3.9389 3.8527 1.0237 1.0035 1.0099 1.0214 0.9910 1.0037 1.0029 0.9950 1.0113 0.9920 1.0045 1.0044 1.0343 1.0034 1.0035 1.0072 1.0040 1.0198
dispcorr: -0.019939318 hartree
energy: -2079.485868670248
dipole: 29.91750 -29.68204 0.23546 -0.67438 0.35673 -0.31764 -4.17017 3.13967 -1.03050
magnitude: 1.10375 au
magnitude: 2.80551 debye
