program: Gaussian 09
title: 000066571
version: EM64L-G09RevD.01
frameworkgroup: C1[X(C14H20N2O5)]
method: RPBEPBE
basis: SDD
operation: Freq
keyword: #p
keyword: freq=noraman
keyword: PBEPBE/SDD
title: #p freq=noraman PBEPBE/SDD
converged: YES YES NO NO
title: Mulliken charges:
elementType: O O O O O N N C C C C C C C C C C C C C C H H H H H H H H H H H H H H H H H H H H
charge: -0.241877 -0.297466 -0.205820 -0.254905 -0.202701 -0.173324 0.009318 -0.370381 -0.379652 0.334092 -0.314696 -0.318794 0.260931 -0.509468 0.221573 -0.544467 0.271373 -0.235375 -0.247688 -0.689691 -0.678176 0.217152 0.270488 0.228312 0.218109 0.203012 0.218741 0.222548 0.196428 0.271650 0.308382 0.220654 0.217019 0.208425 0.208735 0.218003 0.224248 0.231103 0.202675 0.240689 0.240820
chargesum: 0.00000
title: Mulliken charges with hydrogens summed into heavy atoms:
elementType: O O O O O N N C C C C C C C C C C C C C C
charge: -0.241877 -0.297466 -0.205820 -0.254905 -0.202701 -0.173324 0.009318 0.117259 0.066769 0.334092 0.107058 0.100182 0.260931 -0.237819 0.221573 -0.236085 0.271373 0.202298 0.169472 -0.016338 0.006008
polarizability: 2.94212338e+02 -1.25713219e+01 2.35371614e+02 4.40754702e+00 1.34305222e+00 1.11816711e+02
1716.lowfreq: -9.5154 -5.3811 -4.6397 0.0001 0.0006 0.0007 23.4624 33.5959 38.7650
frequency: 23.3225 33.5599 38.6502 51.7404 70.6103 87.6535 96.8872 104.9083 109.2420 121.0273 148.0918 184.1940 204.4638 228.6284 235.1122 241.5416 245.6043 266.9083 276.7802 290.3679 317.6941 324.4810 369.8510 389.5124 408.6479 423.1755 459.6697 474.1586 496.9682 539.2053 545.7637 620.2361 636.9805 665.1305 684.8625 712.0107 719.8450 736.8943 777.2329 807.1429 818.1417 827.8157 837.5537 848.5376 857.5478 892.9018 905.3607 915.9738 927.3258 1014.2004 1020.9804 1028.0197 1036.6774 1053.7399 1071.1913 1081.6161 1104.2190 1114.7056 1115.4351 1128.1817 1135.5960 1155.6516 1180.9574 1192.2864 1200.0926 1201.9358 1254.3593 1259.1770 1261.1944 1266.3415 1278.1079 1286.7071 1321.7250 1339.1202 1343.6086 1357.3053 1358.3916 1365.8977 1370.4959 1381.3222 1397.8416 1399.9947 1407.7261 1419.3475 1446.1847 1450.7454 1452.3795 1457.6460 1458.7091 1463.8692 1473.4308 1477.8831 1485.6163 1488.3460 1521.3665 1562.7969 1614.6036 2918.8899 2936.4869 2953.5210 2953.8173 2964.4484 2965.9754 2996.6039 3000.5045 3015.7727 3025.7853 3051.1844 3081.2269 3089.5190 3094.4323 3097.9606 3103.6153 3107.6716 3114.0461 3185.1718 3187.7172
redmass: 5.1493 9.2053 4.5483 3.3176 4.6469 4.2109 3.2779 1.8545 1.6358 3.7941 4.6012 5.5586 3.8504 4.0087 1.3553 1.3876 2.2275 3.9866 3.3407 3.9643 3.5742 4.0499 7.1427 2.0679 6.2554 5.9080 2.7586 3.4380 5.3171 5.7487 3.9026 3.1842 5.1654 4.9339 5.1914 5.7507 3.2368 6.4338 4.7863 3.6689 1.5690 1.1075 1.3910 1.5890 3.2393 3.7414 1.4132 2.6913 3.6647 2.6119 2.3566 2.6929 2.7718 1.9579 3.0587 4.2924 2.1736 2.2414 2.2325 1.4201 1.4428 4.5495 4.4820 1.7973 1.4313 4.3361 1.4512 1.4798 1.1640 1.1401 1.3413 1.3085 4.3256 1.3879 1.2481 1.3518 2.1925 1.3917 1.3488 1.5729 1.4537 1.2696 3.7865 3.9637 1.0821 1.1438 1.1048 1.0390 1.1047 1.0405 1.0947 1.0604 1.0813 1.0965 3.0880 10.0875 6.4959 1.0680 1.0709 1.0613 1.0599 1.0663 1.0562 1.0362 1.0366 1.1078 1.1077 1.0927 1.0966 1.0979 1.0989 1.0988 1.1014 1.0911 1.1014 1.0895 1.0891
irintensity: 3.0200 0.7027 0.2556 0.2393 0.4709 0.6059 1.8533 1.2420 4.0851 1.6301 2.0996 1.0039 2.2339 2.3175 0.3712 3.5560 1.3983 7.1334 11.0715 14.2625 6.1088 1.5077 1.8853 0.4536 0.2599 3.4027 2.3087 3.6171 6.5348 0.9456 15.2491 13.8270 18.7351 0.3457 4.1297 2.6689 5.4264 21.6447 2.2692 12.5996 27.5356 7.0577 0.2421 5.0156 10.7167 49.4890 20.2359 14.8142 98.1050 56.9072 13.7056 101.7933 47.6265 19.8361 32.6475 34.6007 21.7172 5.5818 0.1922 4.9196 5.0501 21.8635 336.7739 371.4466 157.2133 351.6374 46.9486 54.2639 4.3038 1.6607 33.8733 48.3381 39.7888 6.1571 1.6664 8.9647 100.9676 12.2481 2.4184 51.6050 50.4531 0.3605 32.5402 105.6382 2.6255 13.8022 62.7373 12.1182 27.5597 14.1353 31.6935 13.3337 23.2594 11.2967 250.1273 134.8690 195.3961 55.6998 72.7293 50.6222 36.5716 87.7711 22.2808 21.3896 23.4359 34.4497 24.1256 23.7118 36.4237 36.7816 26.4926 22.8214 35.0757 10.7189 26.7312 5.9035 8.6460
temp: 298.150 k
press: 1.00000 atm
elementType: 8 8 8 8 8 7 7 6 6 6 6 6 6 6 6 6 6 6 6 6 6 1 1 1 1 1 1 1 1 1 1 1 1 1 1 1 1 1 1 1 1
symmnumber: 1
zpe: 867902.6 jmol-1
zpe.correction: 0.330567 hartree
zpe.thermalcorrener: 0.351807 hartree
zpe.thermalcorrenthalpy: 0.352751 hartree
zpe.thermalcorrgfe: 0.278905 hartree
zpe.sumelectzpe: -1029.367155 hartree
zpe.sumelectthermal: -1029.345915 hartree
zpe.sumelectthermalent: -1029.344971 hartree
zpe.sumelectthermalfe: -1029.418816 hartree
dipole: 5.7861 -3.3919 -0.2308
dipole: 6.7109
quadrupole: -154.4479 -110.8481 -122.3804
quadrupole: 30.4486 -1.0236 1.9285
quadrupole: -25.2224 18.3774 6.8451 30.4486 -1.0236 1.9285
hfenergy: -1029.697722 hartree
pointgroup: C01 [X(C14H20N2O5)]
dipole: 2.315077 1.2687631 -0.0423487 debye
polarizability: 293.9567813|10.7768752|234.7087433|-13.8092074|-0.5218594|112.7351383 unknown
InChI: InChI=1S/C14H20N2O5/c1-3-20-13-10-12(16(17)18)14(21-4-2)9-11(13)15-5-7-19-8-6-15/h9-10H,3-8H2,1-2H3
charge 0 multiplicity 1
41 atoms
O  4.505671 2.098341 -0.085243
O  1.622968 -1.984551 0.208786
O  -2.985031 1.29796 0.349413
O  -3.241115 -2.928773 0.430217
O  -4.367597 -0.950733 0.572276
N  1.903675 0.824423 0.084118
N  -3.269543 -1.62203 0.45226
C  2.948672 0.324437 -0.853422
C  2.063062 2.262915 0.39333
C  0.630588 0.2348 0.135432
C  4.350041 0.651117 -0.319649
C  3.498128 2.538488 0.886522
C  0.454924 -1.19834 0.19185
C  -0.542067 1.036273 0.195884
C  -1.848948 0.499904 0.304889
C  -0.829956 -1.738611 0.278121
C  -1.989269 -0.922195 0.340912
C  1.461353 -3.443799 0.395387
C  -2.821231 2.770485 0.316707
C  2.862846 -4.045167 0.445096
C  -4.226284 3.355543 0.422368
H  2.811271 0.816157 -1.842199
H  2.837133 -0.762006 -0.974051
H  1.360495 2.547321 1.196729
H  1.852266 2.892716 -0.501148
H  4.532836 0.09611 0.625244
H  5.121868 0.38816 -1.061041
H  3.658703 3.621621 1.016137
H  3.658946 2.020352 1.856965
H  -0.430239 2.11751 0.104978
H  -1.004968 -2.81505 0.331548
H  0.907199 -3.626971 1.337902
H  0.872428 -3.858601 -0.447389
H  -2.183704 3.088385 1.167298
H  -2.329595 3.065387 -0.633207
H  2.795096 -5.137079 0.599955
H  3.405895 -3.863184 -0.498445
H  3.445772 -3.611225 1.275318
H  -4.178837 4.459672 0.403773
H  -4.852779 3.013651 -0.418134
H  -4.708472 3.036785 1.361314
