program: Orca
programVersion: 5.0.2
elementType: Cl S P O O O N N C C C C C C C C C C C C C C H H H H H H H H H H H H H H H H H H
charge: 0
multiplicity: 1
keywords: wb97x-d3
keywords: def2-TZVPP
keywords: def2/J RIJCOSX
keywords: DEFGRID2
keywords: scfconv7
keywords: smallprint printgap noloewdin
keywords: NOSOSCF
formula: C14H18ClN2O3PS
InChI: InChI=1/C14H18ClN2O3PS/c1-3-9-22-21(18,19-4-2)20-14-10-16-17(11-14)13-7-5-12(15)6-8-13/h5-8,10-11H,3-4,9H2,1-2H3
40 atoms
Cl -7.118635 -1.228756 -0.710903
S  2.540128 -1.257283 -0.243775
P  2.848677 0.53714 0.720772
O  1.672961 1.541355 0.220418
O  4.049778 1.33437 0.060126
O  2.905957 0.299596 2.181419
N  -1.684354 0.643888 0.660443
N  -1.434685 1.115532 1.884758
C  2.426898 -0.785348 -2.015977
C  3.76501 -0.632051 -2.715363
C  0.392574 1.258074 0.619109
C  -2.974481 0.179782 0.333518
C  -0.597684 0.706132 -0.146196
C  -0.175817 1.490763 1.88042
C  4.634348 -1.875148 -2.66208
C  5.374495 1.339148 0.644155
C  -3.20387 -0.483318 -0.866245
C  -4.027195 0.391499 1.217161
C  -4.479298 -0.91638 -1.188255
C  -5.300702 -0.047885 0.89933
C  6.109572 0.039354 0.440083
C  -5.522856 -0.694765 -0.305154
H  1.818322 0.114013 -2.104977
H  1.853359 -1.601568 -2.458196
H  3.541211 -0.385575 -3.756928
H  4.30398 0.22528 -2.311597
H  -0.595376 0.38505 -1.174227
H  5.562073 -1.721258 -3.213219
H  4.124472 -2.734389 -3.101458
H  4.902817 -2.136391 -1.637859
H  0.280959 1.91794 2.759368
H  5.300053 1.589339 1.703007
H  5.887755 2.157442 0.143609
H  -2.404317 -0.678636 -1.567108
H  -3.864203 0.901069 2.154994
H  -4.646411 -1.427111 -2.126382
H  -6.111396 0.123682 1.593979
H  7.119205 0.148634 0.837365
H  5.638722 -0.790063 0.968359
H  6.191952 -0.217375 -0.615886
elementType: Cl S P O N C H
totalener: -2079.46508961 hartree
nucrepener: 2248.29377834 hartree
electener: -4327.75886795 hartree
oneelecener: -7327.57027402 hartree
twoeener: 2999.81140607 hartree
cpcmener: -0.04021689 hartree
kineticenergy: 2073.53390818 hartree
xcener: -141.821731581857 hartree
chargesum: -0.0000000
charge: -0.095689 -0.166535 0.832463 -0.364531 -0.352493 -0.641955 0.178783 -0.353685 -0.101872 -0.122324 0.111020 0.181311 -0.080468 -0.068890 -0.271950 0.047784 -0.224340 -0.207460 -0.126764 -0.116382 -0.269703 0.069993 0.130786 0.133150 0.086376 0.071191 0.186546 0.098093 0.096708 0.072523 0.164024 0.107421 0.111592 0.146338 0.149785 0.146841 0.147326 0.110575 0.090810 0.093601
qa: -0.0957 -0.1665 0.8325 -0.3645 -0.3525 -0.6420 0.1788 -0.3537 -0.1019 -0.1223 0.1110 0.1813 -0.0805 -0.0689 -0.2720 0.0478 -0.2243 -0.2075 -0.1268 -0.1164 -0.2697 0.0700 0.1308 0.1331 0.0864 0.0712 0.1865 0.0981 0.0967 0.0725 0.1640 0.1074 0.1116 0.1463 0.1498 0.1468 0.1473 0.1106 0.0908 0.0936
va: 1.2082 2.2862 5.4800 2.0890 2.0961 1.9646 3.3265 2.8699 3.8464 3.9071 3.9224 3.7676 3.9683 4.0653 3.9180 3.8101 4.0275 3.9743 3.9861 3.9916 3.9203 3.8457 1.0197 1.0022 1.0101 1.0198 0.9891 1.0029 1.0023 1.0098 1.0027 1.0069 0.9923 1.0055 1.0374 1.0040 1.0040 1.0119 1.0095 0.9956
dispcorr: -0.019797437 hartree
energy: -2079.484887046909
dipole: 43.22364 -41.80383 1.41981 -2.76222 2.75360 -0.00862 -12.83832 9.82891 -3.00941
magnitude: 3.32753 au
magnitude: 8.45791 debye
