program: Orca
programVersion: 5.0.2
elementType: Cl S P O O O N N C C C C C C C C C C C C C C H H H H H H H H H H H H H H H H H H
charge: 0
multiplicity: 1
keywords: wb97x-d3
keywords: def2-TZVPP
keywords: def2/J RIJCOSX
keywords: DEFGRID2
keywords: scfconv7
keywords: smallprint printgap noloewdin
keywords: NOSOSCF
formula: C14H18ClN2O3PS
InChI: InChI=1/C14H18ClN2O3PS/c1-3-9-22-21(18,19-4-2)20-14-10-16-17(11-14)13-7-5-12(15)6-8-13/h5-8,10-11H,3-4,9H2,1-2H3
40 atoms
Cl -6.871817 -1.166085 0.874556
S  3.82371 -0.596709 -0.542671
P  2.897687 0.65929 0.824853
O  1.894693 1.616161 -0.027656
O  3.99023 1.706271 1.279419
O  2.246123 -0.053502 1.947105
N  -1.346479 0.386438 -0.511614
N  -0.914827 0.333558 -1.774075
C  3.166511 -2.242408 -0.068504
C  1.763097 -2.530534 -0.564851
C  0.694549 1.106507 -0.439533
C  -2.660372 -0.003252 -0.185788
C  -0.401908 0.849554 0.338906
C  0.328163 0.764731 -1.748902
C  1.64351 -2.558241 -2.078334
C  4.391709 2.917648 0.596418
C  -3.646779 -0.00619 -1.164588
C  -2.972723 -0.37738 1.115633
C  -4.942056 -0.372744 -0.840082
C  -4.270264 -0.730721 1.44439
C  4.993789 2.670984 -0.7641
C  -5.249115 -0.725321 0.464214
H  3.250571 -2.347922 1.010977
H  3.883596 -2.933631 -0.515556
H  1.481732 -3.506215 -0.158957
H  1.062298 -1.810879 -0.136165
H  -0.570423 0.997233 1.39224
H  2.288349 -3.326653 -2.508509
H  1.922817 -1.603141 -2.524615
H  0.620214 -2.775466 -2.384399
H  0.916364 0.825565 -2.651014
H  5.126514 3.365556 1.262062
H  3.538296 3.592972 0.537031
H  -3.416454 0.282456 -2.179852
H  -2.215293 -0.413007 1.886887
H  -5.705417 -0.368876 -1.605941
H  -4.504151 -1.017541 2.460211
H  5.361321 3.621016 -1.152842
H  5.838655 1.984627 -0.714264
H  4.267585 2.290597 -1.483243
elementType: Cl S P O N C H
totalener: -2079.46372797 hartree
nucrepener: 2289.48423193 hartree
electener: -4368.94795990 hartree
oneelecener: -7410.33646889 hartree
twoeener: 3041.38850899 hartree
cpcmener: -0.03380732 hartree
kineticenergy: 2073.51880982 hartree
xcener: -141.820079877443 hartree
chargesum: -0.0000000
charge: -0.094860 -0.195115 0.831365 -0.358011 -0.361406 -0.633193 0.185633 -0.334986 -0.076369 -0.099077 0.141162 0.186370 -0.085701 -0.116102 -0.273796 0.062543 -0.216947 -0.228516 -0.110569 -0.113323 -0.269863 0.066367 0.122448 0.128694 0.089630 0.057841 0.173962 0.098398 0.069624 0.096580 0.166857 0.112419 0.100124 0.146975 0.148826 0.147194 0.147628 0.107777 0.095793 0.083625
qa: -0.0949 -0.1951 0.8314 -0.3580 -0.3614 -0.6332 0.1856 -0.3350 -0.0764 -0.0991 0.1412 0.1864 -0.0857 -0.1161 -0.2738 0.0625 -0.2169 -0.2285 -0.1106 -0.1133 -0.2699 0.0664 0.1224 0.1287 0.0896 0.0578 0.1740 0.0984 0.0696 0.0966 0.1669 0.1124 0.1001 0.1470 0.1488 0.1472 0.1476 0.1078 0.0958 0.0836
va: 1.2087 2.2676 5.4595 2.0531 2.1397 1.9661 3.3207 2.8488 3.8623 3.9038 3.8704 3.7136 3.9726 4.0366 3.9265 3.8315 4.0198 4.0348 3.9821 3.9716 3.9036 3.8542 1.0272 1.0027 1.0113 1.0063 0.9984 1.0032 1.0117 1.0067 0.9980 0.9862 1.0005 1.0326 1.0031 1.0038 1.0033 1.0110 1.0038 1.0077
dispcorr: -0.020666217 hartree
energy: -2079.484394183987
dipole: 28.16641 -27.16573 1.00068 -2.07840 2.72584 0.64744 -10.82224 9.98221 -0.84003
magnitude: 1.45815 au
magnitude: 3.70631 debye
