program: Orca
programVersion: 5.0.2
elementType: Cl S P O O O N N C C C C C C C C C C C C C C H H H H H H H H H H H H H H H H H H
charge: 0
multiplicity: 1
keywords: wb97x-d3
keywords: def2-TZVPP
keywords: def2/J RIJCOSX
keywords: DEFGRID2
keywords: scfconv7
keywords: smallprint printgap noloewdin
keywords: NOSOSCF
formula: C14H18ClN2O3PS
InChI: InChI=1/C14H18ClN2O3PS/c1-3-9-22-21(18,19-4-2)20-14-10-16-17(11-14)13-7-5-12(15)6-8-13/h5-8,10-11H,3-4,9H2,1-2H3
40 atoms
Cl -6.712598 -1.878415 0.722865
S  3.443549 -0.227699 -0.858899
P  2.822069 0.866059 0.792251
O  1.71763 1.92061 0.225226
O  3.984768 1.863488 1.174383
O  2.355987 0.051163 1.934546
N  -1.448769 0.552078 -0.384745
N  -1.074759 0.787061 -1.644969
C  2.943471 -1.928227 -0.375026
C  1.486075 -2.242332 -0.646062
C  0.532034 1.412862 -0.233487
C  -2.702783 -0.029213 -0.115405
C  -0.503292 0.915355 0.512412
C  0.131457 1.305566 -1.572411
C  1.118257 -2.206717 -2.118577
C  4.754667 2.619681 0.21016
C  -3.726947 0.081202 -1.048008
C  -2.915897 -0.715119 1.073783
C  -4.960242 -0.492829 -0.792861
C  -4.154089 -1.27709 1.336872
C  6.17466 2.11905 0.179251
C  -5.168604 -1.165619 0.400359
H  3.211737 -2.083051 0.667379
H  3.597024 -2.564214 -0.974196
H  1.30297 -3.244223 -0.248611
H  0.84792 -1.567375 -0.072402
H  -0.632098 0.831574 1.578545
H  1.706721 -2.930318 -2.685127
H  1.291313 -1.223124 -2.556004
H  0.065835 -2.4489 -2.263849
H  0.674522 1.58715 -2.460863
H  4.70615 3.65775 0.533468
H  4.298618 2.569081 -0.781128
H  -3.57062 0.614366 -1.974293
H  -2.124167 -0.834694 1.800898
H  -5.752252 -0.403523 -1.52342
H  -4.313326 -1.809129 2.264357
H  6.752636 2.73152 -0.511909
H  6.64336 2.189458 1.160058
H  6.229473 1.086112 -0.161433
elementType: Cl S P O N C H
totalener: -2079.46455173 hartree
nucrepener: 2292.60873775 hartree
electener: -4372.07328948 hartree
oneelecener: -7416.44603568 hartree
twoeener: 3044.37274620 hartree
cpcmener: -0.03416687 hartree
kineticenergy: 2073.55218743 hartree
xcener: -141.824003349899 hartree
chargesum: -0.0000000
charge: -0.095208 -0.199124 0.843267 -0.360355 -0.358178 -0.632676 0.190988 -0.332553 -0.081586 -0.091431 0.146285 0.187674 -0.096748 -0.111043 -0.276076 0.031601 -0.224490 -0.227261 -0.105726 -0.113890 -0.224119 0.066433 0.124898 0.128172 0.089297 0.059074 0.175247 0.097754 0.072235 0.095661 0.164015 0.112094 0.094231 0.146876 0.148730 0.147027 0.147858 0.094358 0.092561 0.074128
qa: -0.0952 -0.1991 0.8433 -0.3604 -0.3582 -0.6327 0.1910 -0.3326 -0.0816 -0.0914 0.1463 0.1877 -0.0967 -0.1110 -0.2761 0.0316 -0.2245 -0.2273 -0.1057 -0.1139 -0.2241 0.0664 0.1249 0.1282 0.0893 0.0591 0.1752 0.0978 0.0722 0.0957 0.1640 0.1121 0.0942 0.1469 0.1487 0.1470 0.1479 0.0944 0.0926 0.0741
va: 1.2085 2.2650 5.4676 2.0678 2.1204 1.9690 3.3067 2.8494 3.8558 3.9015 3.8573 3.6966 3.9461 4.0280 3.9240 3.8647 4.0303 4.0359 3.9801 3.9724 3.9230 3.8543 1.0282 1.0038 1.0117 1.0064 0.9990 1.0037 1.0130 1.0054 1.0021 0.9959 0.9928 1.0330 1.0038 1.0040 1.0034 1.0083 1.0036 1.0178
dispcorr: -0.020741424 hartree
energy: -2079.485293152837
dipole: 30.10881 -28.94969 1.15913 -2.18937 2.37036 0.18098 -9.35547 8.33178 -1.02369
magnitude: 1.55701 au
magnitude: 3.95760 debye
