program: Orca
programVersion: 5.0.2
elementType: Cl S P O O O N N C C C C C C C C C C C C C C H H H H H H H H H H H H H H H H H H
charge: 0
multiplicity: 1
keywords: wb97x-d3
keywords: def2-TZVPP
keywords: def2/J RIJCOSX
keywords: DEFGRID2
keywords: scfconv7
keywords: smallprint printgap noloewdin
keywords: NOSOSCF
formula: C14H18ClN2O3PS
InChI: InChI=1/C14H18ClN2O3PS/c1-3-9-22-21(18,19-4-2)20-14-10-16-17(11-14)13-7-5-12(15)6-8-13/h5-8,10-11H,3-4,9H2,1-2H3
40 atoms
Cl -6.814632 -0.937794 -1.131344
S  2.937021 0.564138 -1.361641
P  3.252045 0.836729 0.667097
O  1.810332 1.261773 1.275935
O  3.908559 2.271303 0.834855
O  3.924561 -0.298375 1.34329
N  -1.248978 -0.327093 0.725015
N  -0.651542 -1.304368 1.408344
C  3.425065 -1.186777 -1.605965
C  2.413974 -2.209372 -1.127858
C  0.729351 0.430955 1.168094
C  -2.577177 -0.473876 0.279879
C  -0.446779 0.745755 0.543059
C  0.556723 -0.860931 1.68829
C  1.048768 -2.084057 -1.778746
C  5.33914 2.449359 0.946096
C  -3.060069 -1.732897 -0.053134
C  -3.400316 0.640341 0.180975
C  -4.36863 -1.877539 -0.482555
C  -4.704799 0.499742 -0.262135
C  6.07117 2.179058 -0.34435
C  -5.181122 -0.759537 -0.588287
H  4.403757 -1.338362 -1.154612
H  3.556746 -1.252482 -2.68756
H  2.839402 -3.191303 -1.352793
H  2.323372 -2.162868 -0.04157
H  -0.746317 1.622906 -0.006392
H  0.582084 -1.124342 -1.554401
H  0.377605 -2.867969 -1.428031
H  1.119718 -2.170647 -2.864391
H  1.248006 -1.459895 2.259993
H  5.718686 1.822663 1.754245
H  5.458625 3.488269 1.246762
H  -2.421774 -2.60252 0.013891
H  -3.044704 1.622519 0.462483
H  -4.742027 -2.858718 -0.741265
H  -5.342292 1.369885 -0.334739
H  6.04984 1.124754 -0.621742
H  5.66639 2.765892 -1.168274
H  7.115828 2.462656 -0.214016
elementType: Cl S P O N C H
totalener: -2079.46447465 hartree
nucrepener: 2282.79399824 hartree
electener: -4362.25847289 hartree
oneelecener: -7397.05393628 hartree
twoeener: 3034.79546339 hartree
cpcmener: -0.03399426 hartree
kineticenergy: 2073.53522492 hartree
xcener: -141.820890409121 hartree
chargesum: 0.0000000
charge: -0.093956 -0.179336 0.841594 -0.353906 -0.362541 -0.629055 0.178438 -0.332983 -0.083472 -0.119298 0.126404 0.203093 -0.092479 -0.111922 -0.279382 0.042836 -0.224948 -0.237867 -0.106194 -0.107170 -0.258141 0.065661 0.122854 0.130917 0.090942 0.071860 0.180578 0.069927 0.097887 0.101575 0.162880 0.102637 0.110033 0.143435 0.152243 0.147366 0.147568 0.087013 0.090690 0.104219
qa: -0.0940 -0.1793 0.8416 -0.3539 -0.3625 -0.6291 0.1784 -0.3330 -0.0835 -0.1193 0.1264 0.2031 -0.0925 -0.1119 -0.2794 0.0428 -0.2249 -0.2379 -0.1062 -0.1072 -0.2581 0.0657 0.1229 0.1309 0.0909 0.0719 0.1806 0.0699 0.0979 0.1016 0.1629 0.1026 0.1100 0.1434 0.1522 0.1474 0.1476 0.0870 0.0907 0.1042
va: 1.2097 2.2767 5.4501 2.1043 2.1157 1.9445 3.3233 2.8647 3.8462 3.8855 3.8721 3.6555 3.9612 4.0262 3.9184 3.8467 4.0383 4.0513 3.9806 3.9678 3.9061 3.8559 1.0241 1.0044 1.0095 1.0214 0.9935 1.0095 1.0042 1.0055 1.0080 1.0036 0.9905 1.0274 1.0023 1.0038 1.0033 1.0055 1.0054 1.0097
dispcorr: -0.021192516 hartree
energy: -2079.485667167500
dipole: 32.08604 -31.37858 0.70746 -3.26911 4.15558 0.88646 -6.73535 5.23262 -1.50273
magnitude: 1.88269 au
magnitude: 4.78541 debye
