program: Orca
programVersion: 5.0.2
elementType: Cl S P O O O N N C C C C C C C C C C C C C C H H H H H H H H H H H H H H H H H H
charge: 0
multiplicity: 1
keywords: wb97x-d3
keywords: def2-TZVPP
keywords: def2/J RIJCOSX
keywords: DEFGRID2
keywords: scfconv7
keywords: smallprint printgap noloewdin
keywords: NOSOSCF
formula: C14H18ClN2O3PS
InChI: InChI=1/C14H18ClN2O3PS/c1-3-9-22-21(18,19-4-2)20-14-10-16-17(11-14)13-7-5-12(15)6-8-13/h5-8,10-11H,3-4,9H2,1-2H3
40 atoms
Cl -6.806343 -1.785299 -0.624736
S  2.469624 0.689805 -1.517804
P  2.6766 0.345798 0.512894
O  1.712879 1.439765 1.209598
O  4.026477 1.035588 0.977124
O  2.42715 -1.058046 0.91589
N  -1.735455 0.839445 0.883139
N  -1.753416 1.982794 1.563833
C  2.267463 -1.012243 -2.171804
C  3.552711 -1.814714 -2.234246
C  0.350742 1.353763 1.173741
C  -2.94228 0.212272 0.517995
C  -0.474193 0.408021 0.62331
C  -0.494405 2.313548 1.748367
C  4.601171 -1.226916 -3.161038
C  5.319615 0.559755 0.538363
C  -2.95796 -0.753629 -0.481031
C  -4.124756 0.566814 1.157696
C  -4.146633 -1.373195 -0.829703
C  -5.315364 -0.042935 0.801068
C  5.81217 -0.596191 1.371432
C  -5.319504 -1.014158 -0.187143
H  1.864009 -0.849933 -3.173062
H  1.495246 -1.515732 -1.593387
H  3.96246 -1.943547 -1.230324
H  3.278532 -2.815429 -2.579326
H  -0.272267 -0.517468 0.111414
H  4.929357 -0.24058 -2.830094
H  4.21761 -1.125368 -4.177542
H  5.482448 -1.866834 -3.201947
H  -0.22314 3.21364 2.277552
H  5.978625 1.420231 0.63649
H  5.277915 0.297535 -0.522204
H  -2.057485 -1.030718 -1.011441
H  -4.12711 1.31611 1.935683
H  -4.148068 -2.123673 -1.608058
H  -6.23035 0.239572 1.303296
H  5.841165 -0.340819 2.430519
H  5.201695 -1.489035 1.242157
H  6.828081 -0.841379 1.06046
elementType: Cl S P O N C H
totalener: -2079.46371498 hartree
nucrepener: 2246.67176297 hartree
electener: -4326.13547795 hartree
oneelecener: -7324.28644352 hartree
twoeener: 2998.15096557 hartree
cpcmener: -0.03523666 hartree
kineticenergy: 2073.52492598 hartree
xcener: -141.821238832681 hartree
chargesum: -0.0000000
charge: -0.096048 -0.182764 0.841797 -0.341562 -0.345928 -0.623321 0.159268 -0.341139 -0.078264 -0.116268 0.138533 0.180576 -0.093360 -0.103146 -0.260110 0.052360 -0.221234 -0.214965 -0.126213 -0.113292 -0.250076 0.069525 0.130265 0.121953 0.063725 0.086719 0.176151 0.073271 0.091959 0.095911 0.162427 0.117191 0.080460 0.148710 0.147084 0.146862 0.148473 0.095397 0.079984 0.099089
qa: -0.0960 -0.1828 0.8418 -0.3416 -0.3459 -0.6233 0.1593 -0.3411 -0.0783 -0.1163 0.1385 0.1806 -0.0934 -0.1031 -0.2601 0.0524 -0.2212 -0.2150 -0.1262 -0.1133 -0.2501 0.0695 0.1303 0.1220 0.0637 0.0867 0.1762 0.0733 0.0920 0.0959 0.1624 0.1172 0.0805 0.1487 0.1471 0.1469 0.1485 0.0954 0.0800 0.0991
va: 1.2077 2.2821 5.4655 2.1575 2.1269 1.9414 3.3480 2.8688 3.8442 3.9223 3.9345 3.7415 3.9191 4.0570 3.9237 3.8751 4.0264 3.9961 3.9885 3.9825 3.9236 3.8506 1.0045 1.0247 1.0134 1.0097 1.0003 1.0067 1.0010 1.0045 1.0001 0.9932 0.9959 1.0030 1.0350 1.0040 1.0034 1.0060 1.0156 1.0059
dispcorr: -0.019144462 hartree
energy: -2079.482859441468
dipole: 42.02465 -40.18481 1.83984 -7.16814 6.59023 -0.57791 -9.94810 8.20471 -1.74339
magnitude: 2.59970 au
magnitude: 6.60790 debye
