program: Gaussian 09
title: 000066550
version: EM64L-G09RevD.01
frameworkgroup: C1[X(C13H13NO)]
method: RPBEPBE
basis: SDD
operation: Freq
keyword: #p
keyword: freq=noraman
keyword: PBEPBE/SDD
title: #p freq=noraman PBEPBE/SDD
converged: YES YES NO NO
title: Mulliken charges:
elementType: O N C C C C C C C C C C C C C H H H H H H H H H H H H H
charge: -0.264065 -0.601576 0.143700 0.207897 0.322220 0.416783 -0.673682 -0.439124 -0.475199 -0.379445 -0.437839 -0.841630 -0.261832 -0.245647 0.194346 0.258873 0.268955 0.233329 0.238784 0.247246 0.240954 0.238984 0.233637 0.239454 0.229697 0.230566 0.347137 0.327475
chargesum: 0.00000
title: Mulliken charges with hydrogens summed into heavy atoms:
elementType: O N C C C C C C C C C C C C C
charge: -0.264065 0.073036 0.143700 0.207897 0.322220 0.416783 -0.145854 -0.205795 -0.236415 -0.132199 -0.196885 -0.129555 -0.032135 -0.015080 0.194346
polarizability: 1.90070966e+02 1.38956986e+01 1.77740926e+02 -1.40920965e+01 1.05400141e+01 8.71784072e+01
1716.lowfreq: -11.6062 -0.0007 -0.0001 0.0005 4.9040 7.4443 26.3536 46.5586 72.9574
frequency: 26.0722 46.4237 72.9496 106.9792 152.8739 163.9730 232.0520 270.8400 317.6614 332.8480 363.9191 420.3529 428.4032 474.6619 497.7781 503.4159 510.6533 517.5452 559.1197 564.4629 613.6713 658.4425 663.0379 701.2006 731.4753 756.9980 790.7491 830.2938 837.5378 854.2793 867.7636 888.9622 958.8710 969.1044 977.1309 993.7093 1013.0664 1039.5626 1040.7215 1058.2359 1076.7259 1157.5241 1174.8557 1188.0611 1197.8931 1238.3302 1245.0316 1267.8413 1283.8687 1337.0858 1360.4786 1398.7340 1407.4480 1411.7029 1429.0263 1456.7676 1470.3392 1475.1192 1490.7945 1518.7683 1575.7140 1577.7765 1601.9372 1630.7727 1641.4560 2973.0149 3024.1522 3049.5728 3072.7264 3084.6089 3119.7400 3122.4069 3134.5213 3144.5966 3151.9834 3166.3046 3507.2691 3663.3023
redmass: 7.1419 4.2795 4.4823 3.5693 2.4165 1.2307 3.9502 3.5887 3.5703 3.6888 3.4663 3.2908 4.7623 2.4280 2.6437 2.1732 3.0206 5.3136 1.9916 1.5910 4.1753 1.6696 3.3128 5.1845 4.4125 1.2678 3.0719 1.3376 3.4621 3.3928 3.2670 1.8468 1.3372 1.9502 1.3969 1.3378 2.3170 1.7522 1.8590 1.8704 2.4901 1.3393 1.2073 1.2149 1.4478 1.6966 2.7237 1.6694 1.8271 2.7226 2.9638 1.2973 3.0975 3.1402 3.5969 1.4395 1.7335 1.0508 1.0925 3.2826 1.5988 4.3519 6.0176 6.5437 4.2703 1.0384 1.0610 1.0966 1.0991 1.0982 1.0865 1.0863 1.0886 1.0976 1.0942 1.0998 1.0446 1.1042
irintensity: 8.0638 1.6529 0.9340 0.4253 1.0883 0.1768 3.4150 5.5073 11.5158 0.9802 3.3484 5.6673 1.2351 2.6142 14.7826 5.1888 3.3791 0.2642 55.6001 93.2898 13.6974 51.2168 3.8466 1.9554 5.9247 34.9619 14.9338 61.1101 5.4559 0.4570 0.3892 5.6639 0.2525 13.2736 4.7276 0.2359 1.3440 4.9467 5.5527 0.9921 6.3940 1.0907 3.6519 2.2588 1.5008 3.7773 8.2527 21.9622 24.6420 91.8767 6.5425 7.8210 5.7888 6.0562 0.9127 6.6806 8.6819 15.7077 5.3596 19.8952 98.3500 40.3390 8.3291 3.3827 334.9426 28.4699 14.2915 14.4440 5.2927 18.2266 5.1923 2.6793 6.0613 31.2459 31.3557 24.5452 21.8433 48.2703
temp: 298.150 k
press: 1.00000 atm
elementType: 8 7 6 6 6 6 6 6 6 6 6 6 6 6 6 1 1 1 1 1 1 1 1 1 1 1 1 1
symmnumber: 1
zpe: 595955.9 jmol-1
zpe.correction: 0.226988 hartree
zpe.thermalcorrener: 0.240116 hartree
zpe.thermalcorrenthalpy: 0.241061 hartree
zpe.thermalcorrgfe: 0.186447 hartree
zpe.sumelectzpe: -632.131979 hartree
zpe.sumelectthermal: -632.118851 hartree
zpe.sumelectthermalent: -632.117906 hartree
zpe.sumelectthermalfe: -632.172520 hartree
dipole: -2.6568 2.6210 1.7236
dipole: 4.1108
quadrupole: -94.4834 -85.4620 -85.6132
quadrupole: 11.8506 1.3831 -0.5175
quadrupole: -5.9639 3.0575 2.9064 11.8506 1.3831 -0.5175
hfenergy: -632.3589669 hartree
pointgroup: C01 [X(C13H13N1O1)]
dipole: -1.0286369 0.8410331 0.9221168 debye
polarizability: 186.1422088|18.7199561|173.0192412|-19.1623085|23.6792425|95.8288501 unknown
InChI: InChI=1S/C13H13NO/c1-9-6-7-10-4-2-3-5-11(10)12(9)8-13(14)15/h2-7H,8,14H2,1H3
charge 0 multiplicity 1
28 atoms
O  3.706459 -1.912601 -0.840389
N  2.489534 -1.192461 1.001537
C  0.735784 0.412812 -0.584215
C  -0.522501 -0.292068 -0.437425
C  0.858651 1.738206 -0.108348
C  -1.652418 0.378198 0.177813
C  1.918037 -0.276952 -1.242897
C  -0.271787 2.377969 0.502088
C  -1.494897 1.724766 0.637684
C  -0.703977 -1.651156 -0.870401
C  -2.900551 -0.314085 0.318537
C  2.160196 2.517208 -0.225801
C  -1.930685 -2.302634 -0.718539
C  -3.04326 -1.630418 -0.121934
C  2.778528 -1.205783 -0.34898
H  1.60394 -0.895052 -2.102104
H  2.623981 0.462727 -1.658788
H  -0.15948 3.407548 0.861399
H  -2.348552 2.233019 1.101552
H  0.131612 -2.195053 -1.32188
H  -3.744118 0.211881 0.781645
H  2.422863 2.719926 -1.282113
H  2.080835 3.491372 0.285422
H  3.012767 1.97202 0.220334
H  -2.043296 -3.338518 -1.057041
H  -3.99969 -2.152826 -0.01142
H  1.708413 -0.650373 1.370488
H  3.034714 -1.789471 1.622675
