program: Orca
programVersion: 5.0.2
elementType: Cl S P O O O N N C C C C C C C C C C C C C C H H H H H H H H H H H H H H H H H H
charge: 0
multiplicity: 1
keywords: wb97x-d3
keywords: def2-TZVPP
keywords: def2/J RIJCOSX
keywords: DEFGRID2
keywords: scfconv7
keywords: smallprint printgap noloewdin
keywords: NOSOSCF
formula: C14H18ClN2O3PS
InChI: InChI=1/C14H18ClN2O3PS/c1-3-9-22-21(18,19-4-2)20-14-10-16-17(11-14)13-7-5-12(15)6-8-13/h5-8,10-11H,3-4,9H2,1-2H3
40 atoms
Cl -7.145151 -1.462293 -0.069511
S  4.091637 -0.388261 -1.335841
P  3.066058 0.621001 0.140332
O  1.713908 1.167513 -0.571682
O  3.841868 2.001644 0.245645
O  2.816285 -0.154002 1.377997
N  -1.5847 0.489772 0.361866
N  -1.203375 1.151174 1.456713
C  3.583882 -2.113243 -0.96948
C  2.110323 -2.412604 -1.174311
C  0.492511 1.005251 0.020099
C  -2.907021 0.016304 0.251367
C  -0.579702 0.369578 -0.540897
C  0.056962 1.471574 1.269861
C  1.594004 -2.091571 -2.565156
C  5.161009 2.091763 0.838944
C  -3.336898 -0.622144 -0.906359
C  -3.791336 0.193151 1.310282
C  -4.64066 -1.07895 -1.005777
C  -5.094217 -0.262746 1.211291
C  5.089116 2.261993 2.335207
C  -5.514098 -0.896031 0.053171
H  3.907973 -2.355826 0.041044
H  4.194486 -2.701161 -1.656774
H  1.987117 -3.4802 -0.972808
H  1.51133 -1.899291 -0.418503
H  -0.67686 -0.128102 -1.49099
H  1.623936 -1.021301 -2.771992
H  0.560179 -2.418486 -2.676308
H  2.185128 -2.594656 -3.332519
H  0.606089 2.024151 2.016416
H  5.619914 2.958957 0.368226
H  5.754071 1.215608 0.566785
H  -2.676739 -0.775204 -1.74819
H  -3.472672 0.684425 2.217288
H  -4.963033 -1.572085 -1.912365
H  -5.773106 -0.118984 2.040448
H  6.096313 2.432489 2.71651
H  4.4795 3.122582 2.610307
H  4.691945 1.376993 2.830794
elementType: Cl S P O N C H
totalener: -2079.46337155 hartree
nucrepener: 2249.52347180 hartree
electener: -4328.98684334 hartree
oneelecener: -7330.56116841 hartree
twoeener: 3001.57432507 hartree
cpcmener: -0.03562431 hartree
kineticenergy: 2073.53645577 hartree
xcener: -141.821698988653 hartree
chargesum: -0.0000000
charge: -0.096724 -0.174456 0.853592 -0.364179 -0.362033 -0.628679 0.186367 -0.358521 -0.097204 -0.101149 0.130075 0.183670 -0.099424 -0.071123 -0.284925 0.050838 -0.227159 -0.203182 -0.134085 -0.121790 -0.249547 0.074353 0.126441 0.129844 0.089688 0.061059 0.188935 0.073465 0.099198 0.100559 0.166179 0.110476 0.088276 0.147223 0.151228 0.146376 0.146698 0.098371 0.090887 0.080380
qa: -0.0967 -0.1745 0.8536 -0.3642 -0.3620 -0.6287 0.1864 -0.3585 -0.0972 -0.1011 0.1301 0.1837 -0.0994 -0.0711 -0.2849 0.0508 -0.2272 -0.2032 -0.1341 -0.1218 -0.2495 0.0744 0.1264 0.1298 0.0897 0.0611 0.1889 0.0735 0.0992 0.1006 0.1662 0.1105 0.0883 0.1472 0.1512 0.1464 0.1467 0.0984 0.0909 0.0804
va: 1.2072 2.3020 5.4489 2.0744 2.1206 1.9448 3.3219 2.8717 3.8682 3.8579 3.9047 3.7805 3.9531 4.0482 3.9329 3.8556 4.0287 3.9585 3.9966 3.9990 3.9315 3.8412 1.0224 1.0025 1.0088 1.0239 0.9883 1.0108 1.0026 1.0036 1.0019 0.9898 1.0078 1.0071 1.0383 1.0045 1.0043 1.0069 1.0038 1.0187
dispcorr: -0.019284489 hartree
energy: -2079.482656035947
dipole: 30.90280 -29.41771 1.48510 -3.29178 2.74494 -0.54684 -1.49668 0.11950 -1.37718
magnitude: 2.09790 au
magnitude: 5.33243 debye
