program: Orca
programVersion: 5.0.2
elementType: Cl S P O O O N N C C C C C C C C C C C C C C H H H H H H H H H H H H H H H H H H
charge: 0
multiplicity: 1
keywords: wb97x-d3
keywords: def2-TZVPP
keywords: def2/J RIJCOSX
keywords: DEFGRID2
keywords: scfconv7
keywords: smallprint printgap noloewdin
keywords: NOSOSCF
formula: C14H18ClN2O3PS
InChI: InChI=1/C14H18ClN2O3PS/c1-3-9-22-21(18,19-4-2)20-14-10-16-17(11-14)13-7-5-12(15)6-8-13/h5-8,10-11H,3-4,9H2,1-2H3
40 atoms
Cl -7.370569 -0.951553 0.357418
S  4.419653 -0.44105 -1.238923
P  3.038967 0.388122 0.037548
O  1.682774 0.42516 -0.848932
O  3.409068 1.934356 0.043189
O  2.887726 -0.282685 1.349273
N  -1.642634 0.484264 0.215061
N  -1.184821 1.473435 0.982543
C  4.34197 -2.200891 -0.721252
C  3.026283 -2.90052 -1.00713
C  0.467885 0.632577 -0.253388
C  -3.006747 0.135294 0.248961
C  -0.668211 -0.067037 -0.549383
C  0.098084 1.58155 0.713256
C  2.610857 -2.878145 -2.466942
C  4.511176 2.427626 0.84432
C  -3.557627 -0.640976 -0.76355
C  -3.808641 0.578526 1.294606
C  -4.899359 -0.981017 -0.727351
C  -5.152781 0.248344 1.325898
C  4.045491 2.861206 2.210541
C  -5.691803 -0.531808 0.315666
H  4.607106 -2.253674 0.333029
H  5.154872 -2.661952 -1.284496
H  3.154385 -3.934605 -0.676111
H  2.233485 -2.485634 -0.380908
H  -0.825078 -0.891475 -1.224217
H  2.399977 -1.865538 -2.812012
H  1.7082 -3.469759 -2.618887
H  3.391121 -3.292566 -3.107487
H  0.703694 2.326423 1.206499
H  4.917659 3.266502 0.282655
H  5.294989 1.669636 0.915624
H  -2.963744 -0.98242 -1.599901
H  -3.394392 1.180566 2.089937
H  -5.316591 -1.586528 -1.519971
H  -5.768294 0.599762 2.142593
H  4.888814 3.294712 2.748713
H  3.266843 3.621083 2.144409
H  3.6705 2.024315 2.798192
elementType: Cl S P O N C H
totalener: -2079.46430030 hartree
nucrepener: 2229.30848284 hartree
electener: -4308.77278315 hartree
oneelecener: -7290.25310105 hartree
twoeener: 2981.48031791 hartree
cpcmener: -0.03541238 hartree
kineticenergy: 2073.53941954 hartree
xcener: -141.820010590807 hartree
chargesum: 0.0000000
charge: -0.095621 -0.168930 0.838724 -0.348692 -0.364645 -0.628627 0.174135 -0.354370 -0.100189 -0.100996 0.115573 0.190813 -0.079913 -0.071200 -0.266473 0.049866 -0.224770 -0.216012 -0.125054 -0.110941 -0.259895 0.067027 0.127982 0.130194 0.087630 0.060794 0.181707 0.072269 0.096524 0.090890 0.157707 0.110729 0.092321 0.146743 0.148442 0.148312 0.147765 0.104569 0.091203 0.084408
qa: -0.0956 -0.1689 0.8387 -0.3487 -0.3646 -0.6286 0.1741 -0.3544 -0.1002 -0.1010 0.1156 0.1908 -0.0799 -0.0712 -0.2665 0.0499 -0.2248 -0.2160 -0.1251 -0.1109 -0.2599 0.0670 0.1280 0.1302 0.0876 0.0608 0.1817 0.0723 0.0965 0.0909 0.1577 0.1107 0.0923 0.1467 0.1484 0.1483 0.1478 0.1046 0.0912 0.0844
va: 1.2081 2.3033 5.4557 2.0834 2.1040 1.9398 3.3370 2.8898 3.8644 3.8740 3.9148 3.7358 3.9624 4.0536 3.9341 3.8580 4.0290 3.9936 3.9826 3.9818 3.9309 3.8513 1.0228 1.0025 1.0070 1.0235 0.9918 1.0134 1.0044 1.0013 1.0062 0.9917 1.0050 1.0053 1.0348 1.0031 1.0036 1.0080 1.0023 1.0180
dispcorr: -0.018599560 hartree
energy: -2079.482899861468
dipole: 32.69511 -31.28310 1.41202 -4.05777 3.47567 -0.58210 -1.17728 0.12880 -1.04848
magnitude: 1.85255 au
magnitude: 4.70880 debye
