program: Gaussian 09
title: 000066609
version: EM64L-G09RevD.01
frameworkgroup: C1[X(C17H29NO)]
method: RPBEPBE
basis: SDD
operation: Freq
keyword: #p
keyword: freq=noraman
keyword: PBEPBE/SDD
title: #p freq=noraman PBEPBE/SDD
converged: YES YES NO NO
title: Mulliken charges:
elementType: O N C C C C C C C C C C C C C C C C C H H H H H H H H H H H H H H H H H H H H H H H H H H H H H
charge: -0.432705 -0.094222 0.155642 0.079862 0.353502 0.404912 -0.117330 0.490137 -0.685658 -0.563505 -0.732144 -0.732046 -0.752513 -0.751033 -0.699023 -0.699877 -0.529223 -0.626077 -0.615155 0.263539 0.289520 0.199103 0.263461 0.208887 0.208049 0.199330 0.263768 0.214549 0.215334 0.218600 0.215844 0.223964 0.225887 0.235494 0.214804 0.202395 0.214319 0.233218 0.205332 0.192542 0.217408 0.334912 0.249492 0.185935 0.218247 0.221718 0.224897 0.185909
chargesum: 0.00000
title: Mulliken charges with hydrogens summed into heavy atoms:
elementType: O N C C C C C C C C C C C C C C C C C
charge: -0.097793 -0.094222 0.155642 0.079862 0.353502 0.404912 -0.117330 0.490137 -0.422119 -0.273985 -0.060693 -0.060899 -0.104029 -0.085338 -0.046330 -0.047008 -0.119273 0.027596 0.017368
polarizability: 2.29678587e+02 -1.74547614e+00 2.16740202e+02 5.05065133e+00 2.79992784e+00 1.48248874e+02
1716.lowfreq: -7.3949 -0.8053 -0.0007 -0.0006 -0.0005 6.9787 28.7748 45.6634 59.0435
frequency: 28.7013 45.5698 58.9278 68.6627 73.6125 99.5499 125.0622 146.1228 149.6550 173.9999 192.6119 207.1028 222.3376 236.1743 241.5411 243.2543 259.6931 267.8558 274.9741 301.7258 306.4392 316.5861 327.4746 336.1023 336.5306 343.8985 350.1334 377.6237 389.2288 395.3930 403.4725 431.7045 438.6900 447.7204 509.5926 524.1680 569.5631 599.3074 624.7081 632.0927 744.4192 767.9772 785.5215 803.0760 816.9669 882.0955 901.5134 909.5550 922.3511 928.1553 930.2226 931.2980 946.9701 947.6417 949.6893 991.4551 1017.8351 1022.9732 1026.0036 1033.0976 1034.7264 1037.3330 1092.4901 1103.5984 1132.6103 1146.7830 1167.9203 1191.8366 1197.1296 1198.5490 1204.0239 1210.5727 1222.3275 1250.8522 1259.3614 1269.5904 1284.4108 1304.8718 1348.9736 1368.5215 1370.6637 1375.4489 1378.0061 1387.3435 1396.9443 1410.5995 1417.9936 1426.2597 1434.8366 1442.9739 1455.6972 1456.6241 1459.7491 1461.9103 1465.6259 1473.1771 1474.0199 1475.6838 1477.0998 1477.5417 1477.8158 1486.5583 1487.3937 1488.3859 1491.8240 1500.1867 1506.5673 1598.7925 1610.5302 2830.4580 2846.0722 2861.9617 2969.4416 2972.3266 2973.2420 2974.7957 2977.7234 2980.5041 2980.7317 3014.8654 3025.6596 3056.2160 3058.3251 3061.6514 3061.9519 3067.3591 3071.7559 3072.4131 3074.5494 3075.0378 3081.5877 3083.7316 3087.4468 3110.2946 3113.7331 3148.7981 3167.4954 3609.8612
redmass: 3.0860 3.0130 3.0089 2.6190 2.9119 3.3394 1.0816 2.1681 2.5815 1.4038 2.8281 1.1554 2.2040 1.4667 1.1659 1.2243 1.8414 2.1442 1.9058 2.6777 2.6345 2.6843 1.1355 1.2261 2.7209 2.2621 1.8965 2.2600 2.4906 2.7087 2.0234 2.6516 2.7098 3.3671 2.9320 2.8724 3.4716 3.6522 4.7243 4.6098 4.8051 5.1063 4.8121 3.0732 4.0557 2.2384 1.6396 1.7624 1.6595 1.6796 1.3469 1.6827 1.2115 1.2620 3.2063 1.8006 1.4457 1.4148 1.3835 1.3873 1.9397 1.6336 1.2558 2.8984 1.3871 1.5446 1.8533 2.3829 2.8422 2.2690 2.9615 3.2837 2.0682 2.1167 2.3427 1.7852 1.6063 4.0290 1.7000 1.1945 1.4391 2.0353 1.3953 1.1654 1.2512 1.2087 1.1431 2.5561 1.8668 1.4539 1.0491 1.0535 1.0487 1.0677 1.0690 1.0528 1.0669 1.0782 1.0505 1.0539 1.0562 1.0942 1.0989 1.0749 1.0513 1.0654 1.0623 6.7309 5.8944 1.0698 1.0576 1.0578 1.0352 1.0358 1.0368 1.0354 1.0376 1.0434 1.0778 1.0716 1.0725 1.0981 1.1000 1.0983 1.0990 1.0998 1.0983 1.0991 1.1010 1.1005 1.0992 1.0997 1.1005 1.0977 1.0970 1.0894 1.0899 1.0647
irintensity: 0.3300 0.2298 0.2487 0.5062 1.3561 0.0823 7.6138 0.8180 5.1029 0.7402 1.7765 0.0208 1.4415 1.3729 0.6438 0.2893 0.2184 14.2853 41.0515 0.6641 2.0210 2.7224 0.2170 1.2114 8.3230 11.1619 24.3728 5.9501 0.6228 1.8797 15.9935 0.9134 0.2426 5.5007 0.7747 1.0040 6.4656 3.6722 0.3266 8.3756 1.0477 12.8887 4.8698 8.9836 17.0117 16.5052 18.0671 0.8809 6.9130 1.9994 2.0331 8.5386 1.8311 0.6946 3.5775 11.7459 3.7322 9.0785 0.4470 1.0367 39.7937 11.8169 10.4927 52.9342 2.2167 91.4931 2.2895 7.0475 7.9660 1.4024 7.2291 60.4549 7.0336 72.3898 17.0219 4.5999 12.5464 2.8239 44.0603 24.5638 14.6540 0.8318 24.0245 18.3817 28.5175 22.1635 4.5464 45.6466 39.5261 26.5822 0.0615 0.0136 15.4276 2.5050 1.0312 4.0492 2.1488 14.0390 1.8709 4.0277 4.4870 11.9888 4.3629 8.5923 10.5851 20.8114 19.1105 0.6237 2.0876 50.9726 81.4804 247.9330 22.4741 19.3580 51.2871 39.1457 69.0189 20.8805 26.6432 43.6777 35.8401 11.2010 7.8092 76.0708 5.5978 48.0488 112.1097 17.3489 31.7890 6.1665 81.5528 40.3336 36.2141 0.4792 21.3073 9.9061 1.5134 54.9548
temp: 298.150 k
press: 1.00000 atm
elementType: 8 7 6 6 6 6 6 6 6 6 6 6 6 6 6 6 6 6 6 1 1 1 1 1 1 1 1 1 1 1 1 1 1 1 1 1 1 1 1 1 1 1 1 1 1 1 1 1
symmnumber: 1
zpe: 1107377.8 jmol-1
zpe.correction: 0.421778 hartree
zpe.thermalcorrener: 0.444442 hartree
zpe.thermalcorrenthalpy: 0.445386 hartree
zpe.thermalcorrgfe: 0.371851 hartree
zpe.sumelectzpe: -793.653850 hartree
zpe.sumelectthermal: -793.631186 hartree
zpe.sumelectthermalent: -793.630241 hartree
zpe.sumelectthermalfe: -793.703777 hartree
dipole: -1.3224 1.1918 0.0836
dipole: 1.7821
quadrupole: -117.5296 -108.6127 -120.1402
quadrupole: 4.8289 0.0852 0.7572
quadrupole: -2.1021 6.8148 -4.7127 4.8289 0.0852 0.7572
hfenergy: -794.0756278 hartree
pointgroup: C01 [X(C17H29N1O1)]
dipole: 0.4787609 -0.5087943 0.0593881 debye
polarizability: 229.6616193|-2.5893946|217.1208463|-0.3120669|-2.1829031|147.8851962 unknown
InChI: InChI=1S/C17H29NO/c1-16(2,3)13-9-12(11-18(7)8)10-14(15(13)19)17(4,5)6/h9-10,19H,11H2,1-8H3
charge 0 multiplicity 1
48 atoms
O  -2.64474 -0.816222 0.035397
N  3.707216 0.614014 0.297295
C  -2.382515 2.044522 -0.089187
C  -0.378066 -2.781015 -0.048962
C  -1.166885 1.083146 -0.156823
C  -0.202129 -1.236911 -0.136257
C  -1.315469 -0.336128 -0.090242
C  1.28049 0.731587 -0.337848
C  0.154217 1.579164 -0.278359
C  1.084692 -0.663255 -0.264884
C  -3.352236 1.768173 -1.279506
C  -3.135539 1.860007 1.264384
C  -1.951552 3.534118 -0.179377
C  0.986852 -3.520147 -0.122581
C  -1.223477 -3.318093 -1.251464
C  -1.017537 -3.192266 1.318449
C  2.681739 1.305271 -0.522693
C  3.515599 0.825042 1.746475
C  5.080974 0.935103 -0.133837
H  0.315032 2.660511 -0.324943
H  1.977805 -1.292323 -0.289345
H  -4.212717 2.462728 -1.229756
H  -3.732628 0.73564 -1.250907
H  -2.837552 1.927675 -2.245552
H  -2.467834 2.093214 2.114928
H  -4.001152 2.548626 1.30858
H  -3.502368 0.828416 1.378292
H  -1.286428 3.824981 0.655123
H  -1.440201 3.762057 -1.133295
H  -2.853635 4.170787 -0.123542
H  0.814561 -4.609976 -0.048904
H  1.509059 -3.32568 -1.076555
H  1.657002 -3.228701 0.705736
H  -0.724577 -3.065202 -2.204122
H  -1.312147 -4.418662 -1.187359
H  -2.250205 -2.910762 -1.31667
H  -1.147329 -4.289871 1.360219
H  -0.352731 -2.891228 2.148015
H  -2.002705 -2.733073 1.523897
H  2.655976 2.407733 -0.317265
H  2.991431 1.192466 -1.581999
H  -2.649315 -1.802106 0.059641
H  2.496567 0.516485 2.034735
H  3.65445 1.893155 2.054927
H  4.238251 0.208208 2.310465
H  5.802507 0.333651 0.448185
H  5.206612 0.682201 -1.202215
H  5.350739 2.014442 0.000004
