program: Orca
programVersion: 5.0.2
elementType: Cl S P O O O N N C C C C C C C C C C C C C C H H H H H H H H H H H H H H H H H H
charge: 0
multiplicity: 1
keywords: wb97x-d3
keywords: def2-TZVPP
keywords: def2/J RIJCOSX
keywords: DEFGRID2
keywords: scfconv7
keywords: smallprint printgap noloewdin
keywords: NOSOSCF
formula: C14H18ClN2O3PS
InChI: InChI=1/C14H18ClN2O3PS/c1-3-9-22-21(18,19-4-2)20-14-10-16-17(11-14)13-7-5-12(15)6-8-13/h5-8,10-11H,3-4,9H2,1-2H3
40 atoms
Cl -7.156971 -0.970432 1.147693
S  4.515375 -0.49913 -0.597804
P  2.800092 0.389175 0.113417
O  1.757941 0.182963 -1.117077
O  3.075578 1.951176 0.003724
O  2.300358 -0.111153 1.416465
N  -1.662124 0.530235 -0.430372
N  -1.402775 1.781846 -0.817014
C  4.301604 -2.194022 0.078619
C  3.166106 -2.995649 -0.528459
C  0.453157 0.552875 -0.901295
C  -2.969959 0.165783 -0.050082
C  -0.558204 -0.254881 -0.460024
C  -0.120399 1.816808 -1.103876
C  3.269576 -3.179161 -2.031297
C  3.527788 2.740631 1.131177
C  -3.286276 -1.163182 0.206911
C  -3.952708 1.14326 0.065131
C  -4.573028 -1.512872 0.580998
C  -5.240854 0.793261 0.432179
C  4.996001 2.550045 1.415074
C  -5.546057 -0.533271 0.689343
H  4.208692 -2.116509 1.159907
H  5.261974 -2.667439 -0.131544
H  3.18539 -3.972115 -0.036277
H  2.204957 -2.54936 -0.26401
H  -0.550302 -1.293654 -0.177107
H  4.222471 -3.632543 -2.30903
H  3.185438 -2.229816 -2.561248
H  2.474585 -3.829288 -2.396354
H  0.347376 2.724752 -1.450716
H  2.920111 2.505755 2.005664
H  3.317417 3.769797 0.845647
H  -2.549835 -1.949234 0.116397
H  -3.723797 2.180454 -0.128532
H  -4.805768 -2.549894 0.779215
H  -5.997026 1.561509 0.517443
H  5.220213 1.546607 1.776805
H  5.603789 2.747825 0.532463
H  5.294935 3.254716 2.191585
elementType: Cl S P O N C H
totalener: -2079.46416736 hartree
nucrepener: 2237.44097411 hartree
electener: -4316.90514147 hartree
oneelecener: -7306.58993222 hartree
twoeener: 2989.68479075 hartree
cpcmener: -0.03431856 hartree
kineticenergy: 2073.52710042 hartree
xcener: -141.817250175186 hartree
chargesum: 0.0000000
charge: -0.095930 -0.167451 0.852167 -0.372075 -0.370665 -0.635758 0.176750 -0.355303 -0.100160 -0.093638 0.117735 0.186852 -0.083782 -0.065992 -0.260984 0.045617 -0.222115 -0.207827 -0.132743 -0.117328 -0.255505 0.071850 0.126894 0.130102 0.085671 0.055050 0.188501 0.088018 0.072397 0.095454 0.164898 0.101200 0.108170 0.146643 0.149765 0.146620 0.146742 0.086362 0.091107 0.102689
qa: -0.0959 -0.1675 0.8522 -0.3721 -0.3707 -0.6358 0.1768 -0.3553 -0.1002 -0.0936 0.1177 0.1869 -0.0838 -0.0660 -0.2610 0.0456 -0.2221 -0.2078 -0.1327 -0.1173 -0.2555 0.0719 0.1269 0.1301 0.0857 0.0551 0.1885 0.0880 0.0724 0.0955 0.1649 0.1012 0.1082 0.1466 0.1498 0.1466 0.1467 0.0864 0.0911 0.1027
va: 1.2077 2.2889 5.4447 2.0610 2.1145 1.9428 3.3340 2.8672 3.8654 3.8838 3.9065 3.7689 3.9791 4.0676 3.9354 3.8488 4.0257 3.9700 3.9925 3.9922 3.9161 3.8439 1.0241 1.0025 1.0087 1.0214 0.9872 1.0006 1.0134 1.0048 1.0000 1.0055 0.9902 1.0063 1.0379 1.0042 1.0042 1.0104 1.0029 1.0098
dispcorr: -0.018574568 hartree
energy: -2079.482741929867
dipole: 35.01681 -33.55547 1.46134 -4.88060 4.22033 -0.66027 -1.47754 1.46354 -0.01400
magnitude: 1.60364 au
magnitude: 4.07613 debye
