program: Orca
programVersion: 5.0.2
elementType: Cl S P O O O N N C C C C C C C C C C C C C C H H H H H H H H H H H H H H H H H H
charge: 0
multiplicity: 1
keywords: wb97x-d3
keywords: def2-TZVPP
keywords: def2/J RIJCOSX
keywords: DEFGRID2
keywords: scfconv7
keywords: smallprint printgap noloewdin
keywords: NOSOSCF
formula: C14H18ClN2O3PS
InChI: InChI=1/C14H18ClN2O3PS/c1-3-9-22-21(18,19-4-2)20-14-10-16-17(11-14)13-7-5-12(15)6-8-13/h5-8,10-11H,3-4,9H2,1-2H3
40 atoms
Cl -6.697548 -0.80816 -1.351589
S  2.435971 1.235157 -1.156131
P  3.06719 0.676383 0.735853
O  1.834491 1.019939 1.738272
O  4.015093 1.837229 1.249426
O  3.569777 -0.715106 0.81861
N  -1.299726 -0.357111 1.005376
N  -0.793398 -1.371306 1.712685
C  2.355419 -0.368683 -2.037863
C  1.159775 -1.2298 -1.681132
C  0.683997 0.291264 1.582745
C  -2.585564 -0.460739 0.438745
C  -0.433861 0.676612 0.894439
C  0.414105 -0.995126 2.071827
C  1.123209 -2.482976 -2.543068
C  5.448515 1.810611 1.042431
C  -3.458937 -1.445667 0.885463
C  -2.984299 0.412703 -0.56634
C  -4.722251 -1.556821 0.330216
C  -4.25258 0.310376 -1.113342
C  5.844484 2.136993 -0.375684
C  -5.115435 -0.674496 -0.662819
H  3.297383 -0.894795 -1.888934
H  2.315513 -0.070896 -3.087366
H  1.20677 -1.514661 -0.628899
H  0.240405 -0.655335 -1.814373
H  -0.657605 1.593676 0.376916
H  2.023587 -3.083961 -2.407346
H  1.043146 -2.237142 -3.603065
H  0.267733 -3.106324 -2.282639
H  1.045613 -1.639878 2.662853
H  5.840231 0.840294 1.34971
H  5.83344 2.559571 1.731306
H  -3.163852 -2.131066 1.666135
H  -2.320825 1.174392 -0.951377
H  -5.393054 -2.328141 0.682558
H  -4.552165 0.995583 -1.894182
H  6.929201 2.240327 -0.41435
H  5.563673 1.353852 -1.079056
H  5.407712 3.078119 -0.708584
elementType: Cl S P O N C H
totalener: -2079.46455687 hartree
nucrepener: 2290.42868013 hartree
electener: -4369.89323700 hartree
oneelecener: -7412.08540135 hartree
twoeener: 3042.19216436 hartree
cpcmener: -0.03408047 hartree
kineticenergy: 2073.53840005 hartree
xcener: -141.821154205015 hartree
chargesum: 0.0000000
charge: -0.095112 -0.179626 0.842267 -0.363672 -0.360578 -0.631147 0.202105 -0.337305 -0.073416 -0.079751 0.127825 0.188429 -0.105331 -0.084487 -0.264649 0.041332 -0.222633 -0.227667 -0.108135 -0.120937 -0.256825 0.066739 0.113316 0.129856 0.057128 0.059741 0.175140 0.086187 0.088009 0.093388 0.160188 0.102881 0.110709 0.147702 0.143746 0.146654 0.147854 0.103685 0.085705 0.090684
qa: -0.0951 -0.1796 0.8423 -0.3637 -0.3606 -0.6311 0.2021 -0.3373 -0.0734 -0.0798 0.1278 0.1884 -0.1053 -0.0845 -0.2646 0.0413 -0.2226 -0.2277 -0.1081 -0.1209 -0.2568 0.0667 0.1133 0.1299 0.0571 0.0597 0.1751 0.0862 0.0880 0.0934 0.1602 0.1029 0.1107 0.1477 0.1437 0.1467 0.1479 0.1037 0.0857 0.0907
va: 1.2087 2.2862 5.4618 2.0903 2.1264 1.9482 3.2963 2.8522 3.8444 3.9028 3.8926 3.7171 3.9634 4.0275 3.9560 3.8502 4.0085 4.0230 3.9835 3.9815 3.9058 3.8525 1.0245 1.0030 1.0127 1.0147 0.9998 1.0010 1.0008 1.0040 1.0050 1.0035 0.9902 1.0362 1.0066 1.0042 1.0031 1.0093 1.0071 1.0042
dispcorr: -0.020574158 hartree
energy: -2079.485131028614
dipole: 29.53718 -28.91762 0.61955 -2.92587 4.22288 1.29701 -10.41419 8.97909 -1.43510
magnitude: 2.03115 au
magnitude: 5.16278 debye
