program: Orca
programVersion: 5.0.2
elementType: Cl S P O O O N N C C C C C C C C C C C C C C H H H H H H H H H H H H H H H H H H
charge: 0
multiplicity: 1
keywords: wb97x-d3
keywords: def2-TZVPP
keywords: def2/J RIJCOSX
keywords: DEFGRID2
keywords: scfconv7
keywords: smallprint printgap noloewdin
keywords: NOSOSCF
formula: C14H18ClN2O3PS
InChI: InChI=1/C14H18ClN2O3PS/c1-3-9-22-21(18,19-4-2)20-14-10-16-17(11-14)13-7-5-12(15)6-8-13/h5-8,10-11H,3-4,9H2,1-2H3
40 atoms
Cl -7.322863 -0.149433 -0.858855
S  2.285307 -0.294782 -1.323466
P  2.837345 -0.103393 0.659397
O  1.648044 0.84828 1.221504
O  4.09674 0.843965 0.796613
O  3.040633 -1.37137 1.39278
N  -1.722122 -0.082181 1.030423
N  -1.353574 -0.868946 2.043931
C  3.374272 -1.681462 -1.834707
C  4.845366 -1.32856 -1.950733
C  0.384634 0.324878 1.329571
C  -3.055791 -0.097909 0.572993
C  -0.692917 0.661422 0.557953
C  -0.075287 -0.635992 2.242213
C  5.136608 -0.198286 -2.921632
C  4.223497 2.14472 0.179557
C  -4.009563 -0.851458 1.248542
C  -3.42544 0.635101 -0.548682
C  -5.321291 -0.870595 0.805428
C  -4.737881 0.61978 -0.989982
C  5.688472 2.441251 0.002615
C  -5.681129 -0.132373 -0.310068
H  2.96981 -1.971985 -2.805677
H  3.208451 -2.514224 -1.153226
H  5.256573 -1.100607 -0.964733
H  5.353655 -2.237608 -2.284384
H  -0.776487 1.36265 -0.254719
H  4.751543 -0.425089 -3.917463
H  6.210145 -0.033205 -3.011633
H  4.685782 0.741274 -2.599614
H  0.468154 -1.147925 3.020495
H  3.744595 2.878624 0.828498
H  3.708877 2.151474 -0.783961
H  -3.740749 -1.427524 2.121337
H  -2.708473 1.225003 -1.101494
H  -6.05376 -1.461035 1.338397
H  -5.011385 1.19534 -1.863373
H  5.798558 3.43374 -0.433849
H  6.217392 2.43448 0.955606
H  6.163866 1.724966 -0.668142
elementType: Cl S P O N C H
totalener: -2079.46615041 hartree
nucrepener: 2232.87379609 hartree
electener: -4312.33994650 hartree
oneelecener: -7296.84797259 hartree
twoeener: 2984.50802609 hartree
cpcmener: -0.03870037 hartree
kineticenergy: 2073.52700508 hartree
xcener: -141.820082897759 hartree
chargesum: -0.0000000
charge: -0.095675 -0.187540 0.831445 -0.362001 -0.342773 -0.633039 0.181529 -0.354402 -0.091298 -0.101711 0.090350 0.187340 -0.066219 -0.068507 -0.282679 0.010477 -0.205681 -0.230689 -0.118428 -0.128113 -0.236365 0.070619 0.127956 0.128978 0.066965 0.087454 0.184724 0.099667 0.100537 0.075233 0.163922 0.123805 0.108573 0.150581 0.146905 0.147261 0.147202 0.093278 0.094867 0.085454
qa: -0.0957 -0.1875 0.8314 -0.3620 -0.3428 -0.6330 0.1815 -0.3544 -0.0913 -0.1017 0.0903 0.1873 -0.0662 -0.0685 -0.2827 0.0105 -0.2057 -0.2307 -0.1184 -0.1281 -0.2364 0.0706 0.1280 0.1290 0.0670 0.0875 0.1847 0.0997 0.1005 0.0752 0.1639 0.1238 0.1086 0.1506 0.1469 0.1473 0.1472 0.0933 0.0949 0.0855
va: 1.2081 2.2766 5.4815 2.0910 2.0981 1.9781 3.3290 2.8691 3.8611 3.8600 3.9355 3.7724 3.9493 4.0444 3.9367 3.8272 3.9659 4.0301 3.9919 3.9883 3.9391 3.8465 1.0025 1.0234 1.0224 1.0097 0.9943 1.0035 1.0018 0.9998 1.0049 0.9986 0.9944 1.0378 1.0065 1.0039 1.0038 1.0061 1.0043 1.0034
dispcorr: -0.018982191 hartree
energy: -2079.485132602501
dipole: 45.12389 -44.13739 0.98650 5.19272 -3.26371 1.92901 -12.56028 10.14928 -2.41100
magnitude: 3.24148 au
magnitude: 8.23918 debye
