program: Gaussian 09
title: 000066547
version: EM64L-G09RevD.01
frameworkgroup: C1[X(C14H17N)]
method: RPBEPBE
basis: SDD
operation: Freq
keyword: #pfreq=noraman
keyword: PBEPBE/SDD
title: #p freq=noraman PBEPBE/SDD
converged: YES YES NO NO
title: Mulliken charges:
elementType: N C C C C C C C C C C C C C C H H H H H H H H H H H H H H H H H
charge: -0.208398 0.332763 0.191125 -0.413420 -0.368828 0.408188 -0.378822 -0.371506 -0.476561 -0.675092 -0.680999 -0.257401 -0.433063 -0.265681 -0.247334 0.229525 0.221663 0.207145 0.228628 0.229813 0.251939 0.236398 0.218515 0.223277 0.214286 0.237971 0.227913 0.212742 0.219847 0.235074 0.224968 0.225322
chargesum: 0.00000
title: Mulliken charges with hydrogens summed into heavy atoms:
elementType: N C C C C C C C C C C C C C C
charge: -0.208398 0.332763 0.191125 0.037768 0.066945 0.408188 -0.149009 -0.119567 -0.240164 -0.019013 -0.002372 -0.037554 -0.197989 -0.040713 -0.022011
polarizability: 2.16437107e+02 -8.84531870e+00 1.77425505e+02 8.26368500e+00 1.18729535e+01 9.45697997e+01
1716.lowfreq: -16.5511 -0.0006 -0.0002 0.0006 4.0836 7.4289 36.5578 74.2361 101.3319
frequency: 36.4388 74.2273 101.3267 110.7918 136.1513 172.6052 205.2104 220.2986 225.5447 259.2341 291.6740 331.8208 373.1929 420.0144 445.9180 468.5810 473.0281 506.6559 543.8800 556.4176 587.7480 657.3799 669.6167 741.7645 764.5162 771.8360 778.3942 785.6355 804.0185 809.5373 868.7031 890.2283 892.1264 909.2154 959.0966 971.3384 988.6056 996.0796 1021.8485 1050.8411 1052.9964 1078.8951 1087.0412 1094.8173 1143.6539 1159.4330 1169.3628 1183.3752 1203.5223 1232.4919 1247.9654 1270.1911 1294.0099 1346.1160 1353.7634 1358.0620 1376.0758 1381.1661 1387.0018 1408.3350 1412.0367 1438.6913 1453.0990 1462.1769 1467.3275 1471.5243 1475.9880 1487.5586 1491.1730 1515.0749 1580.8850 1590.2668 1625.5633 2959.7256 2980.6169 2982.9730 2994.6107 3044.0849 3047.2695 3073.9890 3077.9576 3088.0591 3096.6129 3118.0206 3121.4988 3131.2783 3142.4421 3151.5663 3161.7100 3168.1311
redmass: 3.3418 3.2693 2.4181 2.9161 3.0262 3.3558 2.1295 1.8651 1.4959 1.7151 2.3181 2.3319 3.0254 3.6285 3.2081 4.1839 3.5591 4.0940 3.6357 5.4835 3.2053 3.0491 5.0248 1.3416 1.4903 1.3253 2.4413 2.1307 2.1473 1.8851 1.5131 2.6568 1.6835 2.1222 1.3390 1.3728 1.3292 3.5270 2.7384 2.3728 2.3792 1.8535 1.9728 1.6716 1.4674 1.6370 1.1079 1.4765 2.2378 1.8891 1.5923 1.6530 1.2678 1.3436 1.4380 1.2862 2.6583 1.2176 1.2165 2.4163 5.9278 2.3020 2.2205 1.0551 1.0510 1.1011 1.1102 1.1020 1.0582 3.9407 6.1902 6.0320 6.5936 1.0676 1.0359 1.0361 1.0599 1.0977 1.0999 1.0984 1.0983 1.1013 1.1010 1.0859 1.0854 1.0895 1.0935 1.0953 1.0964 1.0971
irintensity: 0.7358 0.4047 0.1230 0.4124 2.3165 3.0205 0.5667 0.2455 0.7997 1.0666 2.2194 0.3196 4.6439 4.4147 5.6133 7.1880 1.6403 1.5104 1.2975 4.9249 4.9888 1.9664 3.7304 1.8033 22.0186 6.1727 30.8143 65.6146 5.3746 53.1509 1.3878 1.6827 3.3461 3.7332 1.1955 4.2579 0.4170 15.2524 21.4174 2.2781 19.8644 21.8941 35.2435 35.0972 1.4793 10.5984 2.2328 22.0486 13.0650 4.0694 23.8670 54.3785 10.4643 20.9912 16.6452 16.3744 5.9682 13.2705 34.8331 27.3523 28.0930 11.2519 48.3839 2.7115 2.8634 8.0773 24.1639 9.0383 8.0313 37.1735 89.2249 4.9748 2.8948 59.2915 29.3795 27.6144 57.4576 7.3613 9.7029 67.7243 36.1286 44.0112 35.7403 1.9370 2.3406 12.3821 27.6118 39.9647 29.6369 17.7629
temp: 298.150 k
press: 1.00000 atm
elementType: 7 6 6 6 6 6 6 6 6 6 6 6 6 6 6 1 1 1 1 1 1 1 1 1 1 1 1 1 1 1 1 1
symmnumber: 1
zpe: 714838.9 jmol-1
zpe.correction: 0.272268 hartree
zpe.thermalcorrener: 0.286190 hartree
zpe.thermalcorrenthalpy: 0.287134 hartree
zpe.thermalcorrgfe: 0.231859 hartree
zpe.sumelectzpe: -597.337307 hartree
zpe.sumelectthermal: -597.323385 hartree
zpe.sumelectthermalent: -597.322441 hartree
zpe.sumelectthermalfe: -597.377716 hartree
dipole: -1.6775 -0.5318 0.1358
dipole: 1.7650
quadrupole: -79.8307 -83.4279 -94.7007
quadrupole: 0.3333 2.4054 1.5340
quadrupole: 6.1558 2.5585 -8.7142 0.3333 2.4054 1.5340
hfenergy: -597.6095752 hartree
pointgroup: C01 [X(C14H17N1)]
dipole: 0.668316 0.1878494 -0.0161888 debye
polarizability: 206.9283832|-0.961589|174.9827664|-34.4594164|18.4582341|106.5212622 unknown
InChI: InChI=1S/C14H17N/c1-3-15(4-2)14-11-7-9-12-8-5-6-10-13(12)14/h5-11H,3-4H2,1-2H3
charge 0 multiplicity 1
32 atoms
N  1.616497 0.698217 -0.590921
C  0.550014 -0.238605 -0.467112
C  -0.754374 0.195456 0.014411
C  2.610463 0.530276 -1.677271
C  2.085034 1.430061 0.618943
C  -1.78705 -0.795481 0.255148
C  0.710201 -1.590706 -0.834539
C  -1.090839 1.578621 0.192422
C  -1.551705 -2.168932 -0.082514
C  3.924854 -0.223801 -1.340239
C  2.574587 0.52108 1.773769
C  -0.336169 -2.542506 -0.657802
C  -3.0545 -0.369664 0.778109
C  -2.343789 1.96626 0.675902
C  -3.326713 0.980764 1.003673
H  2.097756 0.025868 -2.515979
H  2.882949 1.543846 -2.038543
H  2.899846 2.104001 0.292604
H  1.279333 2.074731 1.012193
H  1.674059 -1.935805 -1.220391
H  -0.366622 2.33857 -0.115141
H  -2.341483 -2.907566 0.095996
H  4.511885 0.311442 -0.572812
H  3.735994 -1.247293 -0.97182
H  4.55196 -0.294904 -2.249149
H  1.755078 -0.131572 2.123582
H  3.41497 -0.123639 1.464416
H  2.906527 1.140371 2.628557
H  -0.158435 -3.585668 -0.943508
H  -3.819014 -1.130186 0.97899
H  -2.583305 3.029772 0.786633
H  -4.300408 1.291193 1.398893
