program: Orca
programVersion: 5.0.2
elementType: Cl S P O O O N N C C C C C C C C C C C C C C H H H H H H H H H H H H H H H H H H
charge: 0
multiplicity: 1
keywords: wb97x-d3
keywords: def2-TZVPP
keywords: def2/J RIJCOSX
keywords: DEFGRID2
keywords: scfconv7
keywords: smallprint printgap noloewdin
keywords: NOSOSCF
formula: C14H18ClN2O3PS
InChI: InChI=1/C14H18ClN2O3PS/c1-3-9-22-21(18,19-4-2)20-14-10-16-17(11-14)13-7-5-12(15)6-8-13/h5-8,10-11H,3-4,9H2,1-2H3
40 atoms
Cl -6.657984 -1.23771 -1.006767
S  2.635012 0.396526 -1.764296
P  3.210961 0.666377 0.202918
O  1.985327 1.474338 0.916474
O  4.280947 1.829325 0.093165
O  3.597637 -0.568802 0.926916
N  -1.205141 0.03854 0.876892
N  -0.710964 -0.597548 1.94318
C  2.591564 -1.436416 -1.877745
C  1.335023 -2.070231 -1.313736
C  0.814253 0.790053 1.100427
C  -2.505444 -0.255397 0.422003
C  -0.309038 0.891646 0.327113
C  0.518576 -0.158151 2.091367
C  0.071455 -1.703683 -2.072279
C  5.321768 2.019568 1.086802
C  -2.967908 0.258941 -0.78418
C  -3.330939 -1.074686 1.184274
C  -4.247511 -0.038822 -1.222594
C  -4.607248 -1.378028 0.74322
C  4.79042 2.555164 2.392085
C  -5.061127 -0.857545 -0.457425
H  3.493739 -1.828813 -1.413219
H  2.674881 -1.624967 -2.949466
H  1.484954 -3.15261 -1.357788
H  1.234423 -1.822871 -0.254863
H  -0.512406 1.509065 -0.530801
H  -0.104533 -0.627128 -2.071958
H  -0.802629 -2.17997 -1.627935
H  0.131889 -2.028468 -3.112515
H  1.143763 -0.515696 2.894884
H  6.007222 2.727114 0.626057
H  5.856017 1.079883 1.22973
H  -2.350094 0.891535 -1.406023
H  -2.986172 -1.484577 2.121878
H  -4.595774 0.368944 -2.161464
H  -5.238814 -2.01921 1.342669
H  5.634946 2.772535 3.046333
H  4.232771 3.480354 2.249489
H  4.154448 1.835685 2.908065
elementType: Cl S P O N C H
totalener: -2079.46428679 hartree
nucrepener: 2308.63283064 hartree
electener: -4388.09711743 hartree
oneelecener: -7448.60449910 hartree
twoeener: 3060.50738168 hartree
cpcmener: -0.03328562 hartree
kineticenergy: 2073.53370025 hartree
xcener: -141.820499013092 hartree
chargesum: -0.0000000
charge: -0.096284 -0.179111 0.851792 -0.365300 -0.367368 -0.634822 0.217252 -0.344562 -0.090630 -0.096717 0.163438 0.171014 -0.135298 -0.085478 -0.272147 0.033389 -0.233332 -0.210205 -0.119475 -0.114980 -0.246042 0.070822 0.125028 0.126500 0.090984 0.060568 0.181353 0.065164 0.097060 0.102392 0.160507 0.109807 0.101380 0.144082 0.150146 0.146400 0.145112 0.099955 0.090448 0.087161
qa: -0.0963 -0.1791 0.8518 -0.3653 -0.3674 -0.6348 0.2173 -0.3446 -0.0906 -0.0967 0.1634 0.1710 -0.1353 -0.0855 -0.2721 0.0334 -0.2333 -0.2102 -0.1195 -0.1150 -0.2460 0.0708 0.1250 0.1265 0.0910 0.0606 0.1814 0.0652 0.0971 0.1024 0.1605 0.1098 0.1014 0.1441 0.1501 0.1464 0.1451 0.1000 0.0904 0.0872
va: 1.2076 2.2789 5.4253 2.0608 2.1274 1.9422 3.2818 2.8497 3.8599 3.8864 3.8703 3.7288 3.9696 4.0344 3.9289 3.8653 4.0111 3.9856 3.9905 3.9955 3.9005 3.8462 1.0264 1.0053 1.0104 1.0134 0.9970 1.0100 1.0004 1.0041 1.0050 0.9896 1.0010 1.0058 1.0384 1.0037 1.0049 1.0081 1.0056 1.0142
dispcorr: -0.021780589 hartree
energy: -2079.486067378121
dipole: 24.08267 -23.55090 0.53177 -1.09048 1.89402 0.80354 0.68512 -1.62057 -0.93545
magnitude: 1.34295 au
magnitude: 3.41352 debye
