program: Orca
programVersion: 5.0.2
elementType: Cl S P O O O N N C C C C C C C C C C C C C C H H H H H H H H H H H H H H H H H H
charge: 0
multiplicity: 1
keywords: wb97x-d3
keywords: def2-TZVPP
keywords: def2/J RIJCOSX
keywords: DEFGRID2
keywords: scfconv7
keywords: smallprint printgap noloewdin
keywords: NOSOSCF
formula: C14H18ClN2O3PS
InChI: InChI=1/C14H18ClN2O3PS/c1-3-9-22-21(18,19-4-2)20-14-10-16-17(11-14)13-7-5-12(15)6-8-13/h5-8,10-11H,3-4,9H2,1-2H3
40 atoms
Cl -7.350986 0.094675 -0.66872
S  2.413747 -0.560127 -1.449029
P  2.943041 -0.156329 0.509209
O  1.728499 0.803986 0.989403
O  4.162665 0.850336 0.558144
O  3.19134 -1.352633 1.342344
N  -1.66319 -0.041266 0.931716
N  -1.272945 -0.855009 1.915554
C  3.455238 -2.039955 -1.758103
C  4.952723 -1.795341 -1.731699
C  0.466709 0.296129 1.137976
C  -3.017379 -0.003792 0.542677
C  -0.633549 0.676799 0.421754
C  0.019585 -0.665384 2.05709
C  5.432607 -0.736356 -2.708908
C  4.244217 2.091559 -0.177706
C  -3.930387 -0.865129 1.141812
C  -3.449846 0.889076 -0.431149
C  -5.263126 -0.834286 0.769751
C  -4.78299 0.919045 -0.805064
C  3.886221 3.268936 0.692867
C  -5.68478 0.05761 -0.202708
H  3.135348 -2.36582 -2.749163
H  3.159958 -2.813259 -1.050643
H  5.278419 -1.55188 -0.717672
H  5.421125 -2.754539 -1.970647
H  -0.731666 1.389176 -0.379711
H  5.106262 -0.959115 -3.726957
H  6.521314 -0.685207 -2.713452
H  5.05962 0.256447 -2.451756
H  0.581215 -1.203798 2.804208
H  3.611229 2.048417 -1.066835
H  5.276877 2.158742 -0.515513
H  -3.610288 -1.563986 1.900043
H  -2.769537 1.575761 -0.914841
H  -5.963882 -1.507943 1.243401
H  -5.106739 1.618059 -1.563694
H  4.052249 4.185546 0.126656
H  2.841647 3.254119 0.999246
H  4.512731 3.310957 1.583753
elementType: Cl S P O N C H
totalener: -2079.46518613 hartree
nucrepener: 2236.87586274 hartree
electener: -4316.34104887 hartree
oneelecener: -7304.91273285 hartree
twoeener: 2988.57168398 hartree
cpcmener: -0.03774910 hartree
kineticenergy: 2073.53116513 hartree
xcener: -141.821944539162 hartree
chargesum: -0.0000000
charge: -0.095511 -0.189403 0.839154 -0.359015 -0.350432 -0.631503 0.181052 -0.355321 -0.088961 -0.106689 0.083650 0.188536 -0.061952 -0.067587 -0.262840 0.052660 -0.205685 -0.231583 -0.119101 -0.128670 -0.251021 0.070651 0.129898 0.126528 0.066007 0.087103 0.184275 0.091291 0.096854 0.072187 0.162142 0.098183 0.110928 0.150603 0.147656 0.147358 0.146844 0.097115 0.084953 0.089645
qa: -0.0955 -0.1894 0.8392 -0.3590 -0.3504 -0.6315 0.1811 -0.3553 -0.0890 -0.1067 0.0836 0.1885 -0.0620 -0.0676 -0.2628 0.0527 -0.2057 -0.2316 -0.1191 -0.1287 -0.2510 0.0707 0.1299 0.1265 0.0660 0.0871 0.1843 0.0913 0.0969 0.0722 0.1621 0.0982 0.1109 0.1506 0.1477 0.1474 0.1468 0.0971 0.0850 0.0896
va: 1.2084 2.2725 5.4757 2.0947 2.0923 1.9778 3.3312 2.8713 3.8590 3.8721 3.9296 3.7735 3.9452 4.0523 3.9396 3.8082 3.9640 4.0295 3.9933 3.9888 3.9620 3.8465 1.0025 1.0231 1.0232 1.0078 0.9956 1.0011 1.0050 1.0045 1.0070 1.0025 0.9877 1.0383 1.0066 1.0040 1.0039 1.0061 1.0120 1.0041
dispcorr: -0.018815262 hartree
energy: -2079.484001396429
dipole: 41.53123 -40.72200 0.80923 4.45864 -2.69672 1.76192 -10.24956 7.84041 -2.40915
magnitude: 3.09245 au
magnitude: 7.86037 debye
