program: Orca
programVersion: 5.0.2
elementType: Cl S P O O O N N C C C C C C C C C C C C C C H H H H H H H H H H H H H H H H H H
charge: 0
multiplicity: 1
keywords: wb97x-d3
keywords: def2-TZVPP
keywords: def2/J RIJCOSX
keywords: DEFGRID2
keywords: scfconv7
keywords: smallprint printgap noloewdin
keywords: NOSOSCF
formula: C14H18ClN2O3PS
InChI: InChI=1/C14H18ClN2O3PS/c1-3-9-22-21(18,19-4-2)20-14-10-16-17(11-14)13-7-5-12(15)6-8-13/h5-8,10-11H,3-4,9H2,1-2H3
40 atoms
Cl -6.649997 -1.784799 0.542231
S  3.39476 -0.4408 -0.982459
P  2.944298 0.539892 0.78852
O  1.915524 1.7241 0.357025
O  4.206272 1.382988 1.228635
O  2.443715 -0.333932 1.872901
N  -1.344488 0.647939 -0.344892
N  -1.010233 1.114796 -1.550077
C  2.880371 -2.157323 -0.579995
C  1.388676 -2.401533 -0.68679
C  0.685334 1.369568 -0.125422
C  -2.609718 0.067615 -0.1320
C  -0.344985 0.78055 0.558059
C  0.224807 1.552699 -1.436736
C  0.826559 -2.170064 -2.077804
C  5.024731 2.211163 0.370531
C  -3.661177 0.363925 -0.990702
C  -2.805827 -0.804376 0.931593
C  -4.904111 -0.211129 -0.786563
C  -4.052337 -1.36849 1.145688
C  4.6321 3.662672 0.461959
C  -5.094567 -1.070371 0.283624
H  3.270871 -2.418028 0.400906
H  3.423749 -2.756043 -1.312624
H  1.222601 -3.441498 -0.392649
H  0.856917 -1.791179 0.045257
H  -0.436939 0.489918 1.590828
H  -0.244653 -2.367718 -2.100214
H  1.301405 -2.826371 -2.808845
H  0.975987 -1.14173 -2.408115
H  0.745025 1.982522 -2.2784
H  4.979843 1.854007 -0.660472
H  6.043747 2.061569 0.722171
H  -3.521465 1.04174 -1.820121
H  -1.995844 -1.069233 1.597359
H  -5.716917 0.022973 -1.460012
H  -4.195446 -2.045814 1.97604
H  5.346826 4.25258 -0.112057
H  3.641762 3.850112 0.050756
H  4.660253 4.018909 1.491088
elementType: Cl S P O N C H
totalener: -2079.46430842 hartree
nucrepener: 2301.07235632 hartree
electener: -4380.53666474 hartree
oneelecener: -7433.36921430 hartree
twoeener: 3052.83254956 hartree
cpcmener: -0.03391135 hartree
kineticenergy: 2073.54014960 hartree
xcener: -141.822816556665 hartree
chargesum: -0.0000000
charge: -0.095364 -0.203223 0.843938 -0.358227 -0.360234 -0.634154 0.203720 -0.333187 -0.075129 -0.103880 0.150873 0.184735 -0.112066 -0.107984 -0.275553 0.049628 -0.226643 -0.225737 -0.104267 -0.115091 -0.242171 0.066302 0.124558 0.129794 0.089138 0.063397 0.177997 0.095370 0.099831 0.070073 0.161899 0.094230 0.110605 0.146798 0.145232 0.147522 0.147099 0.097540 0.083004 0.089627
qa: -0.0954 -0.2032 0.8439 -0.3582 -0.3602 -0.6342 0.2037 -0.3332 -0.0751 -0.1039 0.1509 0.1847 -0.1121 -0.1080 -0.2756 0.0496 -0.2266 -0.2257 -0.1043 -0.1151 -0.2422 0.0663 0.1246 0.1298 0.0891 0.0634 0.1780 0.0954 0.0998 0.0701 0.1619 0.0942 0.1106 0.1468 0.1452 0.1475 0.1471 0.0975 0.0830 0.0896
va: 1.2082 2.2650 5.4709 2.0692 2.1379 1.9629 3.2939 2.8500 3.8463 3.8951 3.8531 3.6968 3.9461 4.0374 3.9147 3.8567 4.0277 4.0300 3.9788 3.9773 3.9340 3.8531 1.0273 1.0040 1.0112 1.0130 1.0008 1.0045 1.0048 1.0151 1.0041 0.9966 0.9920 1.0338 1.0056 1.0037 1.0036 1.0072 1.0134 1.0048
dispcorr: -0.021006493 hartree
energy: -2079.485314913285
dipole: 25.61130 -24.46021 1.15109 1.46745 -1.23414 0.23331 -8.24129 7.25290 -0.98839
magnitude: 1.53504 au
magnitude: 3.90176 debye
