program: Orca
programVersion: 5.0.2
elementType: Cl S P O O O N N C C C C C C C C C C C C C C H H H H H H H H H H H H H H H H H H
charge: 0
multiplicity: 1
keywords: wb97x-d3
keywords: def2-TZVPP
keywords: def2/J RIJCOSX
keywords: DEFGRID2
keywords: scfconv7
keywords: smallprint printgap noloewdin
keywords: NOSOSCF
formula: C14H18ClN2O3PS
InChI: InChI=1/C14H18ClN2O3PS/c1-3-9-22-21(18,19-4-2)20-14-10-16-17(11-14)13-7-5-12(15)6-8-13/h5-8,10-11H,3-4,9H2,1-2H3
40 atoms
Cl -6.581968 -2.107699 -0.509053
S  2.882227 0.66324 -1.18289
P  2.833295 0.228266 0.83882
O  1.796719 1.340818 1.409962
O  4.180085 0.692918 1.526039
O  2.501707 -1.171366 1.185672
N  -1.538118 0.79631 0.466147
N  -1.424249 2.083778 0.136148
C  3.223958 -0.986303 -1.927372
C  2.035406 -1.517843 -2.707721
C  0.495728 1.328281 0.980377
C  -2.740241 0.101893 0.229899
C  -0.397164 0.289135 0.989033
C  -0.189747 2.423542 0.438769
C  0.799116 -1.788002 -1.868221
C  4.876853 1.919672 1.204634
C  -2.717616 -1.266642 -0.009324
C  -3.947281 0.789827 0.230887
C  -3.901426 -1.951025 -0.229819
C  -5.129839 0.109958 -0.004709
C  6.159384 1.606842 0.479983
C  -5.100972 -1.257657 -0.227515
H  3.528588 -1.676277 -1.142401
H  4.082324 -0.834261 -2.579933
H  1.793438 -0.829175 -3.520336
H  2.371018 -2.443439 -3.183899
H  -0.314058 -0.725255 1.340886
H  0.01688 -2.241911 -2.476579
H  0.392772 -0.868375 -1.447126
H  1.013767 -2.468625 -1.04308
H  0.173717 3.424442 0.265323
H  5.067145 2.414123 2.155899
H  4.24388 2.583838 0.612559
H  -1.783663 -1.812509 -0.043026
H  -3.974539 1.853431 0.419741
H  -3.876878 -3.015891 -0.415208
H  -6.066474 0.650054 -0.001743
H  6.805665 0.96009 1.073151
H  5.970179 1.127118 -0.480225
H  6.697699 2.535765 0.291351
elementType: Cl S P O N C H
totalener: -2079.46397985 hartree
nucrepener: 2286.89731214 hartree
electener: -4366.36129200 hartree
oneelecener: -7405.04098725 hartree
twoeener: 3038.67969525 hartree
cpcmener: -0.03426350 hartree
kineticenergy: 2073.52976536 hartree
xcener: -141.820135253456 hartree
chargesum: 0.0000000
charge: -0.094183 -0.191091 0.846624 -0.355783 -0.356554 -0.631121 0.185389 -0.338366 -0.079046 -0.081714 0.126395 0.206143 -0.129308 -0.082188 -0.277538 0.040879 -0.229431 -0.224151 -0.127727 -0.104596 -0.228655 0.070575 0.110880 0.129775 0.069794 0.078411 0.185235 0.103230 0.074448 0.085167 0.163316 0.110112 0.091874 0.150192 0.146085 0.146975 0.146807 0.092464 0.075918 0.094767
qa: -0.0942 -0.1911 0.8466 -0.3558 -0.3566 -0.6311 0.1854 -0.3384 -0.0790 -0.0817 0.1264 0.2061 -0.1293 -0.0822 -0.2775 0.0409 -0.2294 -0.2242 -0.1277 -0.1046 -0.2287 0.0706 0.1109 0.1298 0.0698 0.0784 0.1852 0.1032 0.0744 0.0852 0.1633 0.1101 0.0919 0.1502 0.1461 0.1470 0.1468 0.0925 0.0759 0.0948
va: 1.2095 2.2751 5.4766 2.0885 2.1221 1.9635 3.2909 2.8809 3.8566 3.9101 3.8888 3.6700 3.9140 4.0518 3.9361 3.8653 4.0345 4.0393 4.0098 3.9757 3.9300 3.8558 1.0320 1.0074 1.0110 1.0094 0.9984 1.0069 0.9927 1.0052 1.0002 0.9958 0.9966 0.9974 1.0296 1.0047 1.0039 1.0035 1.0113 1.0082
dispcorr: -0.020525105 hartree
energy: -2079.484504960258
dipole: 31.30784 -29.80447 1.50337 1.18983 -0.53786 0.65197 -9.71892 8.55873 -1.16019
magnitude: 2.00779 au
magnitude: 5.10341 debye
