program: Orca
programVersion: 5.0.2
elementType: Cl S P O O O N N C C C C C C C C C C C C C C H H H H H H H H H H H H H H H H H H
charge: 0
multiplicity: 1
keywords: wb97x-d3
keywords: def2-TZVPP
keywords: def2/J RIJCOSX
keywords: DEFGRID2
keywords: scfconv7
keywords: smallprint printgap noloewdin
keywords: NOSOSCF
formula: C14H18ClN2O3PS
InChI: InChI=1/C14H18ClN2O3PS/c1-3-9-22-21(18,19-4-2)20-14-10-16-17(11-14)13-7-5-12(15)6-8-13/h5-8,10-11H,3-4,9H2,1-2H3
40 atoms
Cl -6.92708 -1.533658 0.299371
S  2.456391 -0.395837 -1.805601
P  2.734168 0.149177 0.165603
O  1.853476 1.508638 0.255512
O  4.195303 0.76173 0.230374
O  2.400463 -0.882128 1.172556
N  -1.631885 1.082866 0.310368
N  -1.551929 2.410261 0.316328
C  2.782589 -2.198486 -1.695772
C  4.233022 -2.574986 -1.459819
C  0.492617 1.519898 0.283222
C  -2.88956 0.452231 0.311549
C  -0.410429 0.489896 0.296126
C  -0.270252 2.697643 0.300288
C  5.188094 -2.060313 -2.521546
C  4.910045 0.898469 1.48425
C  -3.003543 -0.896168 -0.006234
C  -4.028061 1.186238 0.626075
C  -4.245249 -1.509249 -0.003212
C  -5.270571 0.576309 0.619666
C  4.281032 1.894288 2.426412
C  -5.37376 -0.769715 0.307014
H  2.439549 -2.573319 -2.661944
H  2.125704 -2.619443 -0.936219
H  4.549979 -2.2421 -0.469042
H  4.267496 -3.66775 -1.432463
H  -0.280412 -0.577775 0.317738
H  6.196488 -2.437571 -2.350307
H  5.242011 -0.971433 -2.522389
H  4.882306 -2.379307 -3.519373
H  0.075549 3.719697 0.299124
H  5.905592 1.222911 1.189378
H  5.00322 -0.082355 1.952722
H  -2.139219 -1.487898 -0.273651
H  -3.953388 2.23444 0.876893
H  -4.321942 -2.558278 -0.254342
H  -6.149964 1.156237 0.864543
H  3.319432 1.554767 2.811515
H  4.943909 2.024456 3.282693
H  4.149979 2.868824 1.956862
elementType: Cl S P O N C H
totalener: -2079.47464187 hartree
nucrepener: 2242.23171886 hartree
electener: -4321.70636073 hartree
oneelecener: -7315.75083732 hartree
twoeener: 2994.04447659 hartree
cpcmener: -0.02715775 hartree
kineticenergy: 2073.53740427 hartree
xcener: -141.820851643636 hartree
chargesum: 0.0000000
charge: -0.094207 -0.168305 0.828291 -0.344704 -0.353228 -0.602892 0.158473 -0.336258 -0.102074 -0.101771 0.138318 0.183003 -0.079735 -0.099859 -0.257236 0.037739 -0.218672 -0.210501 -0.127727 -0.111163 -0.254328 0.068713 0.127695 0.125026 0.063337 0.082709 0.169118 0.094685 0.075109 0.084523 0.158384 0.107248 0.101500 0.141976 0.147182 0.144359 0.144973 0.089085 0.099328 0.091887
qa: -0.0942 -0.1683 0.8283 -0.3447 -0.3532 -0.6029 0.1585 -0.3363 -0.1021 -0.1018 0.1383 0.1830 -0.0797 -0.0999 -0.2572 0.0377 -0.2187 -0.2105 -0.1277 -0.1112 -0.2543 0.0687 0.1277 0.1250 0.0633 0.0827 0.1691 0.0947 0.0751 0.0845 0.1584 0.1072 0.1015 0.1420 0.1472 0.1444 0.1450 0.0891 0.0993 0.0919
va: 1.2097 2.2872 5.4549 2.1406 2.1041 1.9696 3.3493 2.8703 3.8779 3.8909 3.9331 3.7589 3.9110 4.0573 3.9330 3.8634 4.0263 3.9901 3.9933 3.9860 3.9088 3.8587 1.0027 1.0239 1.0195 1.0073 1.0109 1.0051 1.0131 1.0010 1.0014 0.9899 1.0000 1.0071 1.0362 1.0049 1.0046 1.0145 1.0085 1.0055
dispcorr: -0.018436148 hartree
energy: -2079.493078017065
dipole: 40.83671 -39.11059 1.72612 -4.34872 3.65360 -0.69513 -1.44353 1.16941 -0.27413
magnitude: 1.88092 au
magnitude: 4.78091 debye
