program: Orca
programVersion: 5.0.2
elementType: Cl S P O O O N N C C C C C C C C C C C C C C H H H H H H H H H H H H H H H H H H
charge: 0
multiplicity: 1
keywords: wb97x-d3
keywords: def2-TZVPP
keywords: def2/J RIJCOSX
keywords: DEFGRID2
keywords: scfconv7
keywords: smallprint printgap noloewdin
keywords: NOSOSCF
formula: C14H18ClN2O3PS
InChI: InChI=1/C14H18ClN2O3PS/c1-3-9-22-21(18,19-4-2)20-14-10-16-17(11-14)13-7-5-12(15)6-8-13/h5-8,10-11H,3-4,9H2,1-2H3
40 atoms
Cl -7.138204 -1.315698 -0.04543
S  3.149471 0.164085 -1.534338
P  3.314632 0.442798 0.508264
O  1.905275 0.056088 1.194569
O  3.285331 2.026172 0.643296
O  4.408004 -0.295242 1.172644
N  -1.45396 0.254083 0.2959
N  -1.077212 1.448548 -0.154595
C  3.675481 -1.5876 -1.677283
C  2.663192 -2.596887 -1.168365
C  0.670281 0.376586 0.721607
C  -2.804336 -0.134196 0.208426
C  -0.421302 -0.441638 0.830651
C  0.209689 1.54876 0.09484
C  1.330803 -2.557599 -1.895889
C  4.453099 2.830078 0.34784
C  -3.672977 0.576796 -0.612706
C  -3.278108 -1.211682 0.947287
C  -5.006758 0.214462 -0.689306
C  -4.610182 -1.581247 0.86267
C  5.285326 3.058399 1.583237
C  -5.469671 -0.863826 0.047798
H  4.639817 -1.695403 -1.183039
H  3.845457 -1.71636 -2.747941
H  3.119226 -3.583213 -1.294072
H  2.516105 -2.472728 -0.092921
H  -0.510274 -1.437144 1.232211
H  0.666504 -3.341187 -1.53029
H  1.462318 -2.711484 -2.968877
H  0.818181 -1.604353 -1.759277
H  0.748981 2.443318 -0.174318
H  4.06141 3.768022 -0.042248
H  5.042377 2.36435 -0.44609
H  -3.317469 1.416413 -1.192547
H  -2.631165 -1.770661 1.609139
H  -5.675287 0.77586 -1.327875
H  -4.968031 -2.420097 1.443873
H  5.719699 2.132139 1.95842
H  6.104557 3.735533 1.3384
H  4.699733 3.518483 2.379578
elementType: Cl S P O N C H
totalener: -2079.47561694 hartree
nucrepener: 2257.78076946 hartree
electener: -4337.25638640 hartree
oneelecener: -7346.58023805 hartree
twoeener: 3009.32385165 hartree
cpcmener: -0.02951325 hartree
kineticenergy: 2073.51730672 hartree
xcener: -141.818637798198 hartree
chargesum: 0.0000000
charge: -0.093720 -0.185274 0.805524 -0.336834 -0.341661 -0.606763 0.192122 -0.346545 -0.090565 -0.106727 0.140731 0.189188 -0.132047 -0.070462 -0.269839 0.049534 -0.209473 -0.226806 -0.108241 -0.121711 -0.242189 0.065934 0.128399 0.125015 0.085223 0.067483 0.176508 0.096881 0.094790 0.074759 0.154873 0.105308 0.090056 0.148060 0.143205 0.144993 0.145028 0.081487 0.094926 0.088834
qa: -0.0937 -0.1853 0.8055 -0.3368 -0.3417 -0.6068 0.1921 -0.3465 -0.0906 -0.1067 0.1407 0.1892 -0.1320 -0.0705 -0.2698 0.0495 -0.2095 -0.2268 -0.1082 -0.1217 -0.2422 0.0659 0.1284 0.1250 0.0852 0.0675 0.1765 0.0969 0.0948 0.0748 0.1549 0.1053 0.0901 0.1481 0.1432 0.1450 0.1450 0.0815 0.0949 0.0888
va: 1.2100 2.2752 5.4993 2.0966 2.1090 2.0167 3.3167 2.8899 3.8632 3.8702 3.8881 3.7463 3.9453 4.0295 3.9411 3.8515 3.9913 4.0352 3.9836 3.9870 3.9387 3.8613 1.0240 1.0033 1.0095 1.0217 0.9966 1.0040 1.0032 0.9975 1.0126 0.9914 1.0047 1.0361 1.0067 1.0044 1.0044 1.0189 1.0074 1.0044
dispcorr: -0.019487911 hartree
energy: -2079.495104850299
dipole: 30.90382 -30.52653 0.37729 -0.77977 0.56655 -0.21322 -5.02660 4.10272 -0.92388
magnitude: 1.02047 au
magnitude: 2.59384 debye
