program: Orca
programVersion: 5.0.2
elementType: Cl S P O O O N N C C C C C C C C C C C C C C H H H H H H H H H H H H H H H H H H
charge: 0
multiplicity: 1
keywords: wb97x-d3
keywords: def2-TZVPP
keywords: def2/J RIJCOSX
keywords: DEFGRID2
keywords: scfconv7
keywords: smallprint printgap noloewdin
keywords: NOSOSCF
formula: C14H18ClN2O3PS
InChI: InChI=1/C14H18ClN2O3PS/c1-3-9-22-21(18,19-4-2)20-14-10-16-17(11-14)13-7-5-12(15)6-8-13/h5-8,10-11H,3-4,9H2,1-2H3
40 atoms
Cl -6.790905 -1.914466 -0.407516
S  2.492337 0.772783 -1.509442
P  2.665257 0.291313 0.497897
O  1.715777 1.358189 1.254438
O  4.023732 0.921175 1.019977
O  2.397061 -1.132321 0.797789
N  -1.729965 0.859881 0.814239
N  -1.732697 2.096412 1.302689
C  2.263072 -0.878813 -2.275023
C  3.535554 -1.694521 -2.401903
C  0.359052 1.336223 1.140648
C  -2.93967 0.211562 0.506501
C  -0.480311 0.345483 0.702219
C  -0.47094 2.408207 1.502296
C  4.600193 -1.047614 -3.269638
C  5.298755 0.384942 0.606346
C  -2.977853 -0.755708 -0.489757
C  -4.09424 0.536049 1.208343
C  -4.162647 -1.415766 -0.770103
C  -5.282337 -0.112643 0.91957
C  5.80074 -0.655564 1.574475
C  -5.308385 -1.09049 -0.062427
H  1.85208 -0.645911 -3.259434
H  1.490696 -1.412765 -1.724627
H  3.934494 -1.916607 -1.409867
H  3.24786 -2.65749 -2.833877
H  -0.296719 -0.661074 0.366975
H  5.478851 -1.688548 -3.346955
H  4.929715 -0.089838 -2.864314
H  4.23175 -0.869011 -4.28159
H  -0.187114 3.37308 1.893435
H  5.969827 1.24156 0.567394
H  5.230976 -0.019351 -0.407441
H  -2.094194 -0.996988 -1.065874
H  -4.070549 1.286301 1.986368
H  -4.184748 -2.168511 -1.546339
H  -6.177737 0.139192 1.471395
H  6.801735 -0.96525 1.272489
H  5.866918 -0.259058 2.587601
H  5.166868 -1.541701 1.586372
elementType: Cl S P O N C H
totalener: -2079.47452124 hartree
nucrepener: 2245.48581392 hartree
electener: -4324.96033516 hartree
oneelecener: -7321.87069508 hartree
twoeener: 2996.91035992 hartree
cpcmener: -0.02862003 hartree
kineticenergy: 2073.53960428 hartree
xcener: -141.820583031259 hartree
chargesum: 0.0000000
charge: -0.092882 -0.182892 0.826881 -0.339660 -0.340141 -0.597891 0.157131 -0.334513 -0.076550 -0.122555 0.119922 0.180966 -0.090050 -0.099188 -0.256373 0.062096 -0.225528 -0.213655 -0.115373 -0.107545 -0.249400 0.068371 0.128624 0.117422 0.065359 0.086550 0.175930 0.095572 0.070175 0.091580 0.157563 0.112923 0.069221 0.150322 0.145038 0.144468 0.146032 0.095630 0.093319 0.083099
qa: -0.0929 -0.1829 0.8269 -0.3397 -0.3401 -0.5979 0.1571 -0.3345 -0.0766 -0.1226 0.1199 0.1810 -0.0900 -0.0992 -0.2564 0.0621 -0.2255 -0.2137 -0.1154 -0.1075 -0.2494 0.0684 0.1286 0.1174 0.0654 0.0866 0.1759 0.0956 0.0702 0.0916 0.1576 0.1129 0.0692 0.1503 0.1450 0.1445 0.1460 0.0956 0.0933 0.0831
va: 1.2108 2.2784 5.4903 2.1510 2.1285 1.9738 3.3385 2.8804 3.8461 3.9214 3.9467 3.7147 3.9196 4.0555 3.9177 3.8844 4.0338 4.0277 3.9827 3.9766 3.9375 3.8664 1.0044 1.0266 1.0154 1.0083 1.0037 1.0046 1.0105 1.0014 1.0017 0.9931 0.9940 1.0009 1.0294 1.0049 1.0041 1.0066 1.0057 1.0161
dispcorr: -0.019026122 hartree
energy: -2079.493547358838
dipole: 41.87719 -40.19396 1.68324 -6.37690 5.76105 -0.61585 -10.40860 8.94077 -1.46783
magnitude: 2.31669 au
magnitude: 5.88857 debye
