program: Orca
programVersion: 5.0.2
elementType: Cl S P O O O N N C C C C C C C C C C C C C C H H H H H H H H H H H H H H H H H H
charge: 0
multiplicity: 1
keywords: wb97x-d3
keywords: def2-TZVPP
keywords: def2/J RIJCOSX
keywords: DEFGRID2
keywords: scfconv7
keywords: smallprint printgap noloewdin
keywords: NOSOSCF
formula: C14H18ClN2O3PS
InChI: InChI=1/C14H18ClN2O3PS/c1-3-9-22-21(18,19-4-2)20-14-10-16-17(11-14)13-7-5-12(15)6-8-13/h5-8,10-11H,3-4,9H2,1-2H3
40 atoms
Cl -6.77632 0.707477 -0.687878
S  2.545169 0.121692 -1.581646
P  3.085395 0.507474 0.376359
O  2.198375 -0.419783 1.357688
O  2.422362 1.928729 0.640915
O  4.51911 0.330379 0.685176
N  -1.252588 -0.722368 0.81709
N  -0.982527 -1.938543 1.284408
C  3.735647 -1.210287 -1.996347
C  3.463969 -2.539307 -1.316266
C  0.879672 -0.712369 1.200392
C  -2.568225 -0.380595 0.453003
C  -0.15391 0.068953 0.752919
C  0.311647 -1.955335 1.51682
C  2.103747 -3.133611 -1.636649
C  3.015356 3.141455 0.115381
C  -3.639927 -0.981011 1.10258
C  -2.795178 0.548333 -0.554339
C  -4.936045 -0.650657 0.746474
C  -4.091478 0.890986 -0.901776
C  3.990197 3.745472 1.093243
C  -5.154936 0.287416 -0.250495
H  4.741176 -0.846527 -1.790192
H  3.642163 -1.30481 -3.080159
H  4.250006 -3.223352 -1.648806
H  3.593967 -2.442069 -0.236007
H  -0.197863 1.095904 0.431918
H  1.985153 -4.107847 -1.161549
H  1.976788 -3.272988 -2.712143
H  1.288286 -2.499158 -1.287251
H  0.801701 -2.837085 1.900343
H  2.177151 3.811089 -0.069214
H  3.493785 2.941863 -0.846485
H  -3.470902 -1.702711 1.889582
H  -1.971244 1.001405 -1.089824
H  -5.766656 -1.119374 1.256447
H  -4.261051 1.614106 -1.687861
H  4.360094 4.687544 0.68684
H  3.516295 3.960071 2.050732
H  4.848799 3.097644 1.264579
elementType: Cl S P O N C H
totalener: -2079.47578715 hartree
nucrepener: 2281.13830673 hartree
electener: -4360.61409388 hartree
oneelecener: -7393.08319577 hartree
twoeener: 3032.46910189 hartree
cpcmener: -0.02952606 hartree
kineticenergy: 2073.52839458 hartree
xcener: -141.819412611271 hartree
chargesum: 0.0000000
charge: -0.092272 -0.187632 0.805885 -0.339418 -0.344304 -0.606007 0.166159 -0.323830 -0.088490 -0.106992 0.132862 0.183261 -0.084973 -0.114259 -0.266945 0.050223 -0.213551 -0.222278 -0.104676 -0.115180 -0.242451 0.066973 0.127331 0.124994 0.085022 0.068322 0.180433 0.097859 0.094606 0.070787 0.157461 0.105963 0.088478 0.145252 0.146664 0.144206 0.145084 0.094679 0.088962 0.081792
qa: -0.0923 -0.1876 0.8059 -0.3394 -0.3443 -0.6060 0.1662 -0.3238 -0.0885 -0.1070 0.1329 0.1833 -0.0850 -0.1143 -0.2669 0.0502 -0.2136 -0.2223 -0.1047 -0.1152 -0.2425 0.0670 0.1273 0.1250 0.0850 0.0683 0.1804 0.0979 0.0946 0.0708 0.1575 0.1060 0.0885 0.1453 0.1467 0.1442 0.1451 0.0947 0.0890 0.0818
va: 1.2113 2.2759 5.5016 2.1017 2.1087 2.0174 3.3262 2.8649 3.8632 3.8697 3.9105 3.7021 3.9279 4.0379 3.9389 3.8520 4.0339 4.0304 3.9770 3.9782 3.9385 3.8661 1.0238 1.0032 1.0095 1.0225 1.0000 1.0043 1.0036 1.0003 1.0033 0.9912 1.0057 1.0284 1.0038 1.0047 1.0042 1.0075 1.0045 1.0196
dispcorr: -0.019802959 hartree
energy: -2079.495590108400
dipole: 29.56788 -29.69430 -0.12642 -2.51433 3.54825 1.03392 -5.33705 3.96915 -1.36790
magnitude: 1.71934 au
magnitude: 4.37021 debye
