program: Orca
programVersion: 5.0.2
elementType: Cl S P O O O N N C C C C C C C C C C C C C C H H H H H H H H H H H H H H H H H H
charge: 0
multiplicity: 1
keywords: wb97x-d3
keywords: def2-TZVPP
keywords: def2/J RIJCOSX
keywords: DEFGRID2
keywords: scfconv7
keywords: smallprint printgap noloewdin
keywords: NOSOSCF
formula: C14H18ClN2O3PS
InChI: InChI=1/C14H18ClN2O3PS/c1-3-9-22-21(18,19-4-2)20-14-10-16-17(11-14)13-7-5-12(15)6-8-13/h5-8,10-11H,3-4,9H2,1-2H3
40 atoms
Cl -7.256844 -0.204265 -0.743232
S  2.607158 0.520405 -1.279574
P  3.023982 0.327773 0.739617
O  1.672146 0.932536 1.402775
O  4.080854 1.420054 1.182809
O  3.416447 -1.022191 1.191246
N  -1.581148 -0.242342 0.902202
N  -1.092195 -1.294412 1.558375
C  3.785502 -0.694734 -1.993464
C  3.183762 -2.080392 -2.131854
C  0.489889 0.253973 1.306637
C  -2.93142 -0.230262 0.501088
C  -0.652848 0.727575 0.72162
C  0.165972 -1.015093 1.815499
C  4.156973 -3.037418 -2.803744
C  4.097858 2.77884 0.692334
C  -3.379353 0.682365 -0.446544
C  -3.823406 -1.139535 1.059205
C  -4.711729 0.695751 -0.825132
C  -5.152534 -1.134726 0.672239
C  5.253427 2.971736 -0.25417
C  -5.592782 -0.214404 -0.265246
H  4.70294 -0.702302 -1.404849
H  4.038248 -0.278306 -2.969678
H  2.90647 -2.461073 -1.14775
H  2.26346 -2.017659 -2.716771
H  -0.852383 1.666635 0.232976
H  4.435232 -2.691411 -3.801034
H  3.712296 -4.027274 -2.912453
H  5.074062 -3.150651 -2.223163
H  0.790516 -1.713683 2.350325
H  4.196158 3.412623 1.572826
H  3.151071 3.033839 0.211706
H  -2.705081 1.386536 -0.914434
H  -3.490674 -1.854302 1.797885
H  -5.048302 1.411783 -1.562385
H  -5.837096 -1.84688 1.112646
H  5.292668 4.016626 -0.564379
H  6.203797 2.728217 0.221515
H  5.144736 2.361175 -1.151244
elementType: Cl S P O N C H
totalener: -2079.47550620 hartree
nucrepener: 2222.12129136 hartree
electener: -4301.59679755 hartree
oneelecener: -7275.38544761 hartree
twoeener: 2973.78865006 hartree
cpcmener: -0.03133830 hartree
kineticenergy: 2073.51283474 hartree
xcener: -141.814091873934 hartree
chargesum: -0.0000000
charge: -0.093165 -0.193007 0.816953 -0.353196 -0.345109 -0.602385 0.174539 -0.343147 -0.075841 -0.082387 0.093715 0.185407 -0.066466 -0.070846 -0.270562 0.041405 -0.227110 -0.206498 -0.117929 -0.111215 -0.230941 0.065565 0.116548 0.129246 0.065680 0.063551 0.176191 0.081959 0.093722 0.085411 0.157653 0.108018 0.090254 0.143998 0.147557 0.144844 0.145216 0.094419 0.093361 0.074591
qa: -0.0932 -0.1930 0.8170 -0.3532 -0.3451 -0.6024 0.1745 -0.3431 -0.0758 -0.0824 0.0937 0.1854 -0.0665 -0.0708 -0.2706 0.0414 -0.2271 -0.2065 -0.1179 -0.1112 -0.2309 0.0656 0.1165 0.1292 0.0657 0.0636 0.1762 0.0820 0.0937 0.0854 0.1577 0.1080 0.0903 0.1440 0.1476 0.1448 0.1452 0.0944 0.0934 0.0746
va: 1.2105 2.2697 5.5058 2.0853 2.1205 2.0076 3.3260 2.8750 3.8298 3.9123 3.9392 3.7525 3.9593 4.0453 3.9578 3.8656 4.0307 3.9935 3.9810 3.9846 3.9301 3.8650 1.0197 1.0044 1.0260 1.0127 0.9958 1.0010 1.0042 1.0010 1.0097 0.9956 0.9992 1.0052 1.0353 1.0042 1.0043 1.0088 1.0032 1.0113
dispcorr: -0.017887494 hartree
energy: -2079.493393691559
dipole: 38.87592 -38.29640 0.57952 -0.75954 2.94020 2.18066 -13.09688 11.29494 -1.80193
magnitude: 2.88757 au
magnitude: 7.33962 debye
