program: Orca
programVersion: 5.0.2
elementType: Cl S P O O O N N C C C C C C C C C C C C C C H H H H H H H H H H H H H H H H H H
charge: 0
multiplicity: 1
keywords: wb97x-d3
keywords: def2-TZVPP
keywords: def2/J RIJCOSX
keywords: DEFGRID2
keywords: scfconv7
keywords: smallprint printgap noloewdin
keywords: NOSOSCF
formula: C14H18ClN2O3PS
InChI: InChI=1/C14H18ClN2O3PS/c1-3-9-22-21(18,19-4-2)20-14-10-16-17(11-14)13-7-5-12(15)6-8-13/h5-8,10-11H,3-4,9H2,1-2H3
40 atoms
Cl -7.322617 1.403652 0.164766
S  2.880524 -1.24946 -1.218991
P  2.788473 -0.077484 0.494825
O  1.615055 -0.699738 1.41561
O  2.09636 1.283118 0.049711
O  4.04995 -0.008659 1.259603
N  -1.774611 -0.59776 0.554234
N  -1.493812 -1.837688 0.150032
C  4.643668 -1.752982 -1.197941
C  5.571731 -0.694706 -1.763867
C  0.335898 -0.867141 0.969962
C  -3.091728 -0.108266 0.450245
C  -0.68891 0.035571 1.058795
C  -0.216151 -2.021823 0.391846
C  7.018419 -1.164562 -1.746363
C  2.690504 2.178848 -0.913273
C  -3.411818 1.165712 0.905445
C  -4.084154 -0.910512 -0.103506
C  -4.712162 1.632565 0.814732
C  -5.384273 -0.443819 -0.194895
C  3.684517 3.115015 -0.2740
C  -5.694768 0.824685 0.267446
H  4.66421 -2.657361 -1.80867
H  4.917692 -2.043208 -0.184836
H  5.267646 -0.456561 -2.785503
H  5.479656 0.226594 -1.184862
H  -0.703119 1.040235 1.445247
H  7.675754 -0.408773 -2.177473
H  7.150355 -2.082202 -2.322412
H  7.362286 -1.357683 -0.728923
H  0.266264 -2.958746 0.159762
H  1.853639 2.729695 -1.340365
H  3.150458 1.602707 -1.720502
H  -2.666348 1.815384 1.341509
H  -3.851957 -1.902315 -0.462844
H  -4.947513 2.624264 1.176214
H  -6.147831 -1.077344 -0.625649
H  4.55373 2.587508 0.118084
H  4.036849 3.821491 -1.026429
H  3.230464 3.68813 0.534676
elementType: Cl S P O N C H
totalener: -2079.47418642 hartree
nucrepener: 2220.89179574 hartree
electener: -4300.36598216 hartree
oneelecener: -7272.74902923 hartree
twoeener: 2972.38304707 hartree
cpcmener: -0.02942951 hartree
kineticenergy: 2073.52189836 hartree
xcener: -141.817040117808 hartree
chargesum: -0.0000000
charge: -0.093656 -0.203878 0.822133 -0.364855 -0.329978 -0.602411 0.178872 -0.349056 -0.057432 -0.091959 0.081963 0.186441 -0.061721 -0.058930 -0.270835 0.042183 -0.232905 -0.201081 -0.127288 -0.116596 -0.240307 0.070440 0.128831 0.110999 0.069233 0.060016 0.176880 0.093334 0.084407 0.086484 0.160768 0.110353 0.088056 0.144204 0.150206 0.143919 0.144800 0.080143 0.094642 0.093584
qa: -0.0937 -0.2039 0.8221 -0.3649 -0.3300 -0.6024 0.1789 -0.3491 -0.0574 -0.0920 0.0820 0.1864 -0.0617 -0.0589 -0.2708 0.0422 -0.2329 -0.2011 -0.1273 -0.1166 -0.2403 0.0704 0.1288 0.1110 0.0692 0.0600 0.1769 0.0933 0.0844 0.0865 0.1608 0.1104 0.0881 0.1442 0.1502 0.1439 0.1448 0.0801 0.0946 0.0936
va: 1.2101 2.2705 5.5033 2.1306 2.1004 2.0046 3.3341 2.8670 3.8286 3.9045 3.9507 3.7904 3.9279 4.0275 3.9652 3.8543 4.0337 3.9642 3.9952 3.9932 3.9224 3.8550 1.0049 1.0295 1.0114 1.0126 1.0003 1.0034 1.0013 1.0009 1.0056 0.9938 1.0052 1.0080 1.0386 1.0050 1.0048 1.0159 1.0073 1.0057
dispcorr: -0.018194651 hartree
energy: -2079.492381071110
dipole: 46.12968 -45.53495 0.59473 3.10789 -2.11587 0.99201 -11.77832 10.31253 -1.46579
magnitude: 1.86717 au
magnitude: 4.74597 debye
