program: Orca
programVersion: 5.0.2
elementType: Cl S P O O O N N C C C C C C C C C C C C C C H H H H H H H H H H H H H H H H H H
charge: 0
multiplicity: 1
keywords: wb97x-d3
keywords: def2-TZVPP
keywords: def2/J RIJCOSX
keywords: DEFGRID2
keywords: scfconv7
keywords: smallprint printgap noloewdin
keywords: NOSOSCF
formula: C14H18ClN2O3PS
InChI: InChI=1/C14H18ClN2O3PS/c1-3-9-22-21(18,19-4-2)20-14-10-16-17(11-14)13-7-5-12(15)6-8-13/h5-8,10-11H,3-4,9H2,1-2H3
40 atoms
Cl -6.821281 -0.56717 -1.253718
S  2.520946 0.953911 -1.245181
P  3.072025 0.310017 0.649251
O  1.862052 0.874214 1.580121
O  4.268911 1.202818 1.170899
O  3.348844 -1.134227 0.77501
N  -1.380075 -0.311008 1.01432
N  -0.964671 -1.252798 1.863392
C  3.005791 -0.456139 -2.321154
C  1.810852 -1.265102 -2.793453
C  0.65492 0.236943 1.509751
C  -2.675201 -0.374456 0.468067
C  -0.429572 0.619674 0.767505
C  0.27296 -0.93886 2.174973
C  1.089383 -2.040504 -1.705562
C  4.33133 2.640907 1.058697
C  -3.689211 -1.012685 1.171949
C  -2.938288 0.192706 -0.772561
C  -4.964602 -1.078952 0.638081
C  -4.217277 0.139998 -1.300986
C  5.451983 3.0356 0.132194
C  -5.223511 -0.496305 -0.592787
H  3.734501 -1.071948 -1.796277
H  3.517155 0.004901 -3.16588
H  1.110007 -0.607841 -3.314018
H  2.188926 -1.961766 -3.547751
H  -0.584226 1.471579 0.126622
H  1.759521 -2.732534 -1.194197
H  0.274279 -2.62579 -2.132453
H  0.653207 -1.380345 -0.955033
H  0.850109 -1.548721 2.853154
H  4.500344 3.017366 2.067365
H  3.379026 3.053209 0.716245
H  -3.490352 -1.456308 2.137528
H  -2.153127 0.663767 -1.349153
H  -5.750719 -1.575749 1.190276
H  -4.415252 0.582931 -2.267566
H  6.409227 2.639133 0.471889
H  5.271529 2.688337 -0.885435
H  5.530368 4.12304 0.107627
elementType: Cl S P O N C H
totalener: -2079.47355083 hartree
nucrepener: 2285.17267915 hartree
electener: -4364.64622998 hartree
oneelecener: -7401.49412868 hartree
twoeener: 3036.84789870 hartree
cpcmener: -0.03114719 hartree
kineticenergy: 2073.53183278 hartree
xcener: -141.817498098801 hartree
chargesum: 0.0000000
charge: -0.092079 -0.205143 0.827112 -0.360124 -0.347222 -0.598684 0.183603 -0.330440 -0.072594 -0.085967 0.135653 0.190931 -0.100522 -0.085606 -0.244593 0.032858 -0.222508 -0.224376 -0.100806 -0.113357 -0.225405 0.064981 0.110006 0.126594 0.066190 0.075740 0.168768 0.090485 0.099041 0.041058 0.158407 0.108884 0.089625 0.146109 0.143607 0.144969 0.145397 0.091733 0.075564 0.092112
qa: -0.0921 -0.2051 0.8271 -0.3601 -0.3472 -0.5987 0.1836 -0.3304 -0.0726 -0.0860 0.1357 0.1909 -0.1005 -0.0856 -0.2446 0.0329 -0.2225 -0.2244 -0.1008 -0.1134 -0.2254 0.0650 0.1100 0.1266 0.0662 0.0757 0.1688 0.0905 0.0990 0.0411 0.1584 0.1089 0.0896 0.1461 0.1436 0.1450 0.1454 0.0917 0.0756 0.0921
va: 1.2115 2.2594 5.5022 2.0726 2.1292 2.0088 3.2990 2.8689 3.8584 3.8954 3.8863 3.6982 3.9517 4.0566 3.9521 3.8753 4.0403 4.0322 3.9742 3.9792 3.9265 3.8666 1.0322 1.0072 1.0112 1.0096 0.9999 1.0090 1.0094 0.9909 1.0041 0.9956 0.9945 1.0309 1.0050 1.0044 1.0042 1.0037 1.0138 1.0085
dispcorr: -0.020292136 hartree
energy: -2079.493842964508
dipole: 28.42665 -28.15255 0.27410 3.25784 -1.01994 2.23790 -9.16149 7.62167 -1.53981
magnitude: 2.73027 au
magnitude: 6.93978 debye
