program: Orca
programVersion: 5.0.2
elementType: Cl S P O O O N N C C C C C C C C C C C C C C H H H H H H H H H H H H H H H H H H
charge: 0
multiplicity: 1
keywords: wb97x-d3
keywords: def2-TZVPP
keywords: def2/J RIJCOSX
keywords: DEFGRID2
keywords: scfconv7
keywords: smallprint printgap noloewdin
keywords: NOSOSCF
formula: C14H18ClN2O3PS
InChI: InChI=1/C14H18ClN2O3PS/c1-3-9-22-21(18,19-4-2)20-14-10-16-17(11-14)13-7-5-12(15)6-8-13/h5-8,10-11H,3-4,9H2,1-2H3
40 atoms
Cl -6.834496 -1.297339 0.984601
S  3.701762 -0.364374 -0.99494
P  2.794846 1.009342 0.264963
O  1.719253 1.841553 -0.6189
O  3.835856 2.199413 0.382232
O  2.241257 0.404644 1.495942
N  -1.474153 0.416543 -0.793966
N  -1.10935 0.272078 -2.068391
C  3.10225 -1.954278 -0.307461
C  1.682916 -2.308177 -0.706779
C  0.523448 1.24528 -0.902678
C  -2.747173 -0.009776 -0.368466
C  -0.515747 1.005067 -0.042145
C  0.10566 0.768877 -2.154273
C  1.28646 -3.674933 -0.167718
C  5.045508 2.074051 1.163961
C  -2.951001 -0.396182 0.950294
C  -3.800683 -0.037504 -1.273809
C  -4.211095 -0.7888 1.37094
C  -5.057367 -0.442742 -0.85821
C  4.818337 2.448891 2.606637
C  -5.257705 -0.808538 0.463535
H  3.232075 -1.937891 0.773741
H  3.809368 -2.684685 -0.705996
H  0.990345 -1.554729 -0.326172
H  1.595844 -2.295019 -1.79535
H  -0.642585 1.233733 1.003045
H  1.322985 -3.699953 0.922948
H  1.944499 -4.46222 -0.540216
H  0.268838 -3.927128 -0.468156
H  0.643365 0.771492 -3.090067
H  5.756469 2.750022 0.69167
H  5.446594 1.061129 1.075575
H  -2.133821 -0.411725 1.659466
H  -3.650865 0.262968 -2.301274
H  -4.362148 -1.087939 2.39927
H  -5.875278 -0.458132 -1.565693
H  4.41436 3.457252 2.699765
H  4.145443 1.754806 3.109361
H  5.774074 2.424133 3.131767
elementType: Cl S P O N C H
totalener: -2079.47692512 hartree
nucrepener: 2267.05986332 hartree
electener: -4346.53678844 hartree
oneelecener: -7365.53230753 hartree
twoeener: 3018.99551909 hartree
cpcmener: -0.02656497 hartree
kineticenergy: 2073.52614546 hartree
xcener: -141.814837316829 hartree
chargesum: -0.0000000
charge: -0.092561 -0.185489 0.830325 -0.352909 -0.350687 -0.603317 0.178869 -0.329381 -0.073630 -0.080389 0.104089 0.185112 -0.073926 -0.097020 -0.268554 0.051073 -0.229687 -0.214911 -0.108242 -0.105947 -0.247295 0.064916 0.112975 0.127081 0.051311 0.068343 0.171654 0.085426 0.086601 0.093351 0.155921 0.109722 0.083995 0.149620 0.145770 0.145970 0.144934 0.089861 0.081594 0.095432
qa: -0.0926 -0.1855 0.8303 -0.3529 -0.3507 -0.6033 0.1789 -0.3294 -0.0736 -0.0804 0.1041 0.1851 -0.0739 -0.0970 -0.2686 0.0511 -0.2297 -0.2149 -0.1082 -0.1059 -0.2473 0.0649 0.1130 0.1271 0.0513 0.0683 0.1717 0.0854 0.0866 0.0934 0.1559 0.1097 0.0840 0.1496 0.1458 0.1460 0.1449 0.0899 0.0816 0.0954
va: 1.2109 2.2933 5.4874 2.0985 2.1351 1.9813 3.3082 2.8597 3.8434 3.9166 3.9240 3.7048 3.9312 4.0425 3.9621 3.8647 4.0358 4.0366 3.9704 3.9793 3.9300 3.8676 1.0279 1.0041 1.0035 1.0152 1.0000 1.0006 1.0014 1.0038 1.0066 0.9900 1.0073 1.0028 1.0305 1.0039 1.0045 1.0040 1.0193 1.0069
dispcorr: -0.019486314 hartree
energy: -2079.496411430775
dipole: 28.82017 -27.45661 1.36356 -7.78376 7.44293 -0.34083 4.92646 -4.51041 0.41605
magnitude: 1.46579 au
magnitude: 3.72575 debye
