program: Orca
programVersion: 5.0.2
elementType: Cl S P O O O N N C C C C C C C C C C C C C C H H H H H H H H H H H H H H H H H H
charge: 0
multiplicity: 1
keywords: wb97x-d3
keywords: def2-TZVPP
keywords: def2/J RIJCOSX
keywords: DEFGRID2
keywords: scfconv7
keywords: smallprint printgap noloewdin
keywords: NOSOSCF
formula: C14H18ClN2O3PS
InChI: InChI=1/C14H18ClN2O3PS/c1-3-9-22-21(18,19-4-2)20-14-10-16-17(11-14)13-7-5-12(15)6-8-13/h5-8,10-11H,3-4,9H2,1-2H3
40 atoms
Cl -6.894859 -1.386537 0.365133
S  3.672196 -0.365179 -0.721997
P  2.897251 0.497973 0.999961
O  1.851503 1.637427 0.485932
O  4.021429 1.415754 1.627535
O  2.311679 -0.457429 1.964276
N  -1.358048 0.530274 -0.357807
N  -0.8930 0.773822 -1.584269
C  3.102694 -2.101732 -0.543854
C  1.674754 -2.332032 -1.00135
C  0.668996 1.233808 -0.061239
C  -2.675376 0.065182 -0.182624
C  -0.444526 0.795512 0.604966
C  0.340221 1.202027 -1.425413
C  1.460188 -2.086993 -2.484571
C  5.094001 2.087981 0.933648
C  -3.039085 -0.588849 0.98811
C  -3.614555 0.263878 -1.187872
C  -4.340594 -1.029674 1.160882
C  -4.912156 -0.189141 -1.022004
C  4.628885 3.148557 -0.034095
C  -5.26985 -0.82947 0.153688
H  3.259025 -2.410079 0.488149
H  3.806031 -2.666727 -1.158934
H  1.43303 -3.373054 -0.765675
H  0.990326 -1.722075 -0.407026
H  -0.642111 0.690111 1.658674
H  2.079718 -2.754031 -3.087152
H  1.705313 -1.062636 -2.769396
H  0.420282 -2.261174 -2.762302
H  0.949999 1.475097 -2.272918
H  5.715762 1.341512 0.435259
H  5.688715 2.534251 1.728893
H  -2.320026 -0.777121 1.773914
H  -3.34313 0.774559 -2.100807
H  -4.614772 -1.53626 2.076159
H  -5.637832 -0.030256 -1.808033
H  5.508974 3.674405 -0.40856
H  4.107298 2.739156 -0.90067
H  3.983863 3.883292 0.44804
elementType: Cl S P O N C H
totalener: -2079.47343811 hartree
nucrepener: 2291.84567258 hartree
electener: -4371.31911069 hartree
oneelecener: -7415.00509236 hartree
twoeener: 3043.68598168 hartree
cpcmener: -0.02864340 hartree
kineticenergy: 2073.51419315 hartree
xcener: -141.817136994153 hartree
chargesum: 0.0000000
charge: -0.093317 -0.206414 0.819416 -0.356142 -0.347092 -0.607305 0.184885 -0.329657 -0.078136 -0.099980 0.150532 0.184675 -0.088995 -0.118207 -0.269776 0.009372 -0.226235 -0.215699 -0.114322 -0.107097 -0.228243 0.066079 0.125678 0.126068 0.087653 0.061355 0.171988 0.095413 0.071243 0.096549 0.161661 0.104019 0.113705 0.146346 0.146793 0.145218 0.145118 0.101965 0.076672 0.094210
qa: -0.0933 -0.2064 0.8194 -0.3561 -0.3471 -0.6073 0.1849 -0.3297 -0.0781 -0.1000 0.1505 0.1847 -0.0890 -0.1182 -0.2698 0.0094 -0.2262 -0.2157 -0.1143 -0.1071 -0.2282 0.0661 0.1257 0.1261 0.0877 0.0614 0.1720 0.0954 0.0712 0.0965 0.1617 0.1040 0.1137 0.1463 0.1468 0.1452 0.1451 0.1020 0.0767 0.0942
va: 1.2104 2.2619 5.4902 2.0634 2.1367 2.0058 3.3195 2.8473 3.8578 3.9053 3.8693 3.7260 3.9790 4.0281 3.9253 3.8622 4.0391 4.0201 3.9764 3.9824 3.8947 3.8630 1.0282 1.0037 1.0115 1.0070 0.9984 1.0035 1.0111 1.0065 1.0007 0.9992 0.9890 1.0041 1.0337 1.0043 1.0045 1.0096 1.0099 1.0057
dispcorr: -0.020683199 hartree
energy: -2079.494121310062
dipole: 28.42370 -27.08576 1.33794 -0.26415 0.58593 0.32178 -10.52252 9.70990 -0.81262
magnitude: 1.59812 au
magnitude: 4.06209 debye
