program: Orca
programVersion: 5.0.2
elementType: Cl S P O O O N N C C C C C C C C C C C C C C H H H H H H H H H H H H H H H H H H
charge: 0
multiplicity: 1
keywords: wb97x-d3
keywords: def2-TZVPP
keywords: def2/J RIJCOSX
keywords: DEFGRID2
keywords: scfconv7
keywords: smallprint printgap noloewdin
keywords: NOSOSCF
formula: C14H18ClN2O3PS
InChI: InChI=1/C14H18ClN2O3PS/c1-3-9-22-21(18,19-4-2)20-14-10-16-17(11-14)13-7-5-12(15)6-8-13/h5-8,10-11H,3-4,9H2,1-2H3
40 atoms
Cl -7.0359 1.164649 1.130585
S  4.677939 -0.197598 -0.484637
P  2.753026 0.296517 0.055523
O  1.854181 -0.583944 -0.963099
O  2.56256 1.738358 -0.58688
O  2.411517 0.132287 1.48503
N  -1.619935 -0.572781 -0.457536
N  -1.467234 -1.75984 -1.039799
C  5.014382 -1.588879 0.662306
C  4.178159 -2.834713 0.432766
C  0.509227 -0.751953 -0.824465
C  -2.905229 -0.141353 -0.080426
C  -0.442269 0.08605 -0.306028
C  -0.180437 -1.890725 -1.267243
C  4.282227 -3.412833 -0.967309
C  3.053105 2.925615 0.078206
C  -3.067313 0.87486 0.853487
C  -4.022392 -0.747733 -0.644888
C  -4.33887 1.284686 1.220345
C  -5.292447 -0.347968 -0.269055
C  1.955661 3.599234 0.861812
C  -5.445578 0.667755 0.661111
H  4.916636 -1.221028 1.682519
H  6.072403 -1.798843 0.493925
H  4.525316 -3.573094 1.161207
H  3.134194 -2.638404 0.687129
H  -0.370261 1.07371 0.1183
H  3.879003 -2.734364 -1.719782
H  3.725079 -4.347399 -1.039359
H  5.319262 -3.625517 -1.233963
H  0.21973 -2.776567 -1.736666
H  3.420585 3.571304 -0.718228
H  3.903072 2.682774 0.720699
H  -2.215613 1.349627 1.321718
H  -3.908854 -1.53448 -1.376663
H  -4.454543 2.073819 1.950729
H  -6.155084 -0.828466 -0.710424
H  2.338938 4.529825 1.282299
H  1.105514 3.848172 0.22612
H  1.608137 2.978813 1.687939
elementType: Cl S P O N C H
totalener: -2079.47527471 hartree
nucrepener: 2241.25058587 hartree
electener: -4320.72586058 hartree
oneelecener: -7313.78360577 hartree
twoeener: 2993.05774519 hartree
cpcmener: -0.02858692 hartree
kineticenergy: 2073.52645108 hartree
xcener: -141.817043340088 hartree
chargesum: -0.0000000
charge: -0.094061 -0.167415 0.809780 -0.339491 -0.356832 -0.600207 0.163993 -0.339968 -0.103535 -0.101918 0.133899 0.182656 -0.084986 -0.085488 -0.263196 0.045890 -0.220227 -0.211590 -0.121395 -0.107124 -0.259162 0.066421 0.127574 0.125983 0.085202 0.062495 0.178994 0.073385 0.095917 0.088355 0.157210 0.108361 0.093744 0.143289 0.146310 0.144499 0.143633 0.103836 0.089401 0.085768
qa: -0.0941 -0.1674 0.8098 -0.3395 -0.3568 -0.6002 0.1640 -0.3400 -0.1035 -0.1019 0.1339 0.1827 -0.0850 -0.0855 -0.2632 0.0459 -0.2202 -0.2116 -0.1214 -0.1071 -0.2592 0.0664 0.1276 0.1260 0.0852 0.0625 0.1790 0.0734 0.0959 0.0884 0.1572 0.1084 0.0937 0.1433 0.1463 0.1445 0.1436 0.1038 0.0894 0.0858
va: 1.2097 2.2988 5.4922 2.1067 2.1006 1.9812 3.3330 2.8704 3.8725 3.8736 3.9441 3.7446 3.9549 4.0335 3.9341 3.8604 4.0318 4.0012 3.9855 3.9828 3.9285 3.8619 1.0215 1.0026 1.0075 1.0225 0.9894 1.0138 1.0044 1.0016 1.0012 0.9922 1.0036 1.0049 1.0351 1.0047 1.0050 1.0090 1.0023 1.0157
dispcorr: -0.018743053 hartree
energy: -2079.494017764126
dipole: 32.38004 -30.83636 1.54368 -4.67181 5.55734 0.88554 0.57392 -0.61198 -0.03807
magnitude: 1.78005 au
magnitude: 4.52453 debye
