program: Orca
programVersion: 5.0.2
elementType: Cl S P O O O N N C C C C C C C C C C C C C C H H H H H H H H H H H H H H H H H H
charge: 0
multiplicity: 1
keywords: wb97x-d3
keywords: def2-TZVPP
keywords: def2/J RIJCOSX
keywords: DEFGRID2
keywords: scfconv7
keywords: smallprint printgap noloewdin
keywords: NOSOSCF
formula: C14H18ClN2O3PS
InChI: InChI=1/C14H18ClN2O3PS/c1-3-9-22-21(18,19-4-2)20-14-10-16-17(11-14)13-7-5-12(15)6-8-13/h5-8,10-11H,3-4,9H2,1-2H3
40 atoms
Cl -6.882084 -0.322951 1.211111
S  4.008717 -1.013227 -0.190752
P  2.996035 0.735714 0.250909
O  2.004213 1.041018 -1.008458
O  4.128669 1.807092 -0.03148
O  2.310199 0.763044 1.562134
N  -1.316256 -0.040853 -0.744399
N  -0.940165 -0.760879 -1.801965
C  3.226949 -2.188489 0.981614
C  1.866845 -2.705805 0.554592
C  0.764814 0.476862 -1.067665
C  -2.6387 -0.122033 -0.268196
C  -0.313753 0.731689 -0.262092
C  0.322971 -0.462899 -2.01303
C  1.87835 -3.468729 -0.758183
C  4.034792 3.1713 0.449642
C  -3.641952 -0.612087 -1.096932
C  -2.947212 0.290288 1.022654
C  -4.946265 -0.682563 -0.638125
C  -4.253872 0.232724 1.4777
C  2.948099 3.975026 -0.221602
C  -5.248047 -0.252466 0.644198
H  3.195023 -1.721577 1.964345
H  3.950653 -3.00416 1.036221
H  1.520095 -3.364848 1.356108
H  1.149959 -1.882572 0.512493
H  -0.433005 1.40936 0.566299
H  2.541437 -4.334604 -0.706412
H  2.212998 -2.845904 -1.588557
H  0.879961 -3.831695 -1.004333
H  0.874354 -0.914019 -2.823714
H  5.013643 3.597114 0.238166
H  3.902622 3.158154 1.532738
H  -3.414083 -0.936049 -2.102412
H  -2.180684 0.64759 1.696783
H  -5.721127 -1.063924 -1.289299
H  -4.483204 0.558282 2.483191
H  3.043971 5.013626 0.097944
H  3.039531 3.952808 -1.307498
H  1.947392 3.643236 0.055402
elementType: Cl S P O N C H
totalener: -2079.47428043 hartree
nucrepener: 2280.65328657 hartree
electener: -4360.12756699 hartree
oneelecener: -7392.64576510 hartree
twoeener: 3032.51819811 hartree
cpcmener: -0.02667522 hartree
kineticenergy: 2073.51578127 hartree
xcener: -141.814687295207 hartree
chargesum: -0.0000000
charge: -0.093318 -0.178414 0.835105 -0.360835 -0.357187 -0.607014 0.179371 -0.328836 -0.098962 -0.099812 0.125402 0.179561 -0.061553 -0.113786 -0.270534 0.028198 -0.208005 -0.225762 -0.112209 -0.116159 -0.246361 0.067881 0.125191 0.125803 0.088533 0.059495 0.169041 0.097501 0.067891 0.098007 0.162546 0.108083 0.101590 0.146290 0.146590 0.144803 0.144550 0.099672 0.091047 0.086594
qa: -0.0933 -0.1784 0.8351 -0.3608 -0.3572 -0.6070 0.1794 -0.3288 -0.0990 -0.0998 0.1254 0.1796 -0.0616 -0.1138 -0.2705 0.0282 -0.2080 -0.2258 -0.1122 -0.1162 -0.2464 0.0679 0.1252 0.1258 0.0885 0.0595 0.1690 0.0975 0.0679 0.0980 0.1625 0.1081 0.1016 0.1463 0.1466 0.1448 0.1445 0.0997 0.0910 0.0866
va: 1.2103 2.2812 5.4593 2.0614 2.1349 1.9782 3.3268 2.8462 3.8716 3.8992 3.8969 3.7446 3.9387 4.0509 3.9279 3.8740 4.0072 4.0357 3.9858 3.9791 3.9029 3.8609 1.0256 1.0040 1.0097 1.0065 1.0016 1.0033 1.0122 1.0054 0.9981 0.9886 0.9995 1.0350 1.0038 1.0047 1.0045 1.0087 1.0064 1.0090
dispcorr: -0.020391585 hartree
energy: -2079.494672013128
dipole: 22.92851 -22.33475 0.59376 -2.11048 2.68478 0.57429 -1.32575 1.57823 0.25248
magnitude: 0.86378 au
magnitude: 2.19555 debye
