program: Orca
programVersion: 5.0.2
elementType: Cl S P O O O N N C C C C C C C C C C C C C C H H H H H H H H H H H H H H H H H H
charge: 0
multiplicity: 1
keywords: wb97x-d3
keywords: def2-TZVPP
keywords: def2/J RIJCOSX
keywords: DEFGRID2
keywords: scfconv7
keywords: smallprint printgap noloewdin
keywords: NOSOSCF
formula: C14H18ClN2O3PS
InChI: InChI=1/C14H18ClN2O3PS/c1-3-9-22-21(18,19-4-2)20-14-10-16-17(11-14)13-7-5-12(15)6-8-13/h5-8,10-11H,3-4,9H2,1-2H3
40 atoms
Cl -7.372338 0.091711 -0.632368
S  2.466069 -0.520241 -1.468751
P  2.953745 -0.130514 0.506666
O  1.71835 0.81556 0.967518
O  4.157247 0.895088 0.581121
O  3.201389 -1.329159 1.331945
N  -1.668063 -0.040733 0.909551
N  -1.267715 -0.881746 1.863424
C  3.466657 -2.032113 -1.750845
C  4.969705 -1.823919 -1.738976
C  0.463637 0.297419 1.109143
C  -3.025174 -0.001612 0.534898
C  -0.644381 0.695552 0.413719
C  0.024046 -0.692091 2.004243
C  5.471965 -0.828329 -2.769115
C  4.2287 2.144876 -0.136474
C  -3.93194 -0.861203 1.146534
C  -3.468844 0.888191 -0.436744
C  -5.268344 -0.831686 0.788129
C  -4.805965 0.916834 -0.796449
C  3.870628 3.309124 0.752156
C  -5.701198 0.056949 -0.182568
H  3.131866 -2.374301 -2.731832
H  3.15683 -2.782056 -1.024685
H  5.302484 -1.536338 -0.738989
H  5.416495 -2.804234 -1.929425
H  -0.752012 1.431603 -0.364641
H  5.15226 -1.103406 -3.776281
H  6.561536 -0.790027 -2.767804
H  5.109374 0.181426 -2.571518
H  0.592184 -1.252291 2.73051
H  3.59201 2.114754 -1.024051
H  5.259823 2.223636 -0.478592
H  -3.602429 -1.55685 1.9043
H  -2.793401 1.571907 -0.931614
H  -5.963578 -1.504531 1.271496
H  -5.137808 1.613318 -1.554261
H  4.030884 4.235396 0.199069
H  2.827601 3.287113 1.064504
H  4.501017 3.341125 1.641032
elementType: Cl S P O N C H
totalener: -2079.47536699 hartree
nucrepener: 2232.53959927 hartree
electener: -4312.01496626 hartree
oneelecener: -7296.16268872 hartree
twoeener: 2984.14772246 hartree
cpcmener: -0.03065280 hartree
kineticenergy: 2073.53030410 hartree
xcener: -141.820100147416 hartree
chargesum: -0.0000000
charge: -0.093859 -0.194880 0.821898 -0.356575 -0.342906 -0.600354 0.180786 -0.349587 -0.087765 -0.107036 0.086341 0.186600 -0.066757 -0.065267 -0.257686 0.048403 -0.200668 -0.231584 -0.116961 -0.127244 -0.247428 0.069617 0.126479 0.126385 0.067047 0.084399 0.178598 0.087853 0.095778 0.070875 0.159170 0.094558 0.109195 0.150390 0.144034 0.145106 0.143884 0.094650 0.084864 0.089648
qa: -0.0939 -0.1949 0.8219 -0.3566 -0.3429 -0.6004 0.1808 -0.3496 -0.0878 -0.1070 0.0863 0.1866 -0.0668 -0.0653 -0.2577 0.0484 -0.2007 -0.2316 -0.1170 -0.1272 -0.2474 0.0696 0.1265 0.1264 0.0670 0.0844 0.1786 0.0879 0.0958 0.0709 0.1592 0.0946 0.1092 0.1504 0.1440 0.1451 0.1439 0.0946 0.0849 0.0896
va: 1.2100 2.2670 5.4952 2.0947 2.0982 2.0182 3.3299 2.8715 3.8617 3.8772 3.9376 3.7878 3.9495 4.0509 3.9377 3.8215 3.9631 4.0317 3.9928 3.9944 3.9573 3.8565 1.0027 1.0241 1.0229 1.0082 0.9980 1.0016 1.0050 1.0069 1.0085 1.0037 0.9887 1.0386 1.0074 1.0046 1.0050 1.0066 1.0121 1.0043
dispcorr: -0.018618491 hartree
energy: -2079.493985477853
dipole: 41.53185 -40.71686 0.81498 4.24675 -2.60282 1.64393 -10.19334 8.01514 -2.17820
magnitude: 2.84802 au
magnitude: 7.23910 debye
