program: Orca
programVersion: 5.0.2
elementType: Cl S P O O O N N C C C C C C C C C C C C C C H H H H H H H H H H H H H H H H H H
charge: 0
multiplicity: 1
keywords: wb97x-d3
keywords: def2-TZVPP
keywords: def2/J RIJCOSX
keywords: DEFGRID2
keywords: scfconv7
keywords: smallprint printgap noloewdin
keywords: NOSOSCF
formula: C14H18ClN2O3PS
InChI: InChI=1/C14H18ClN2O3PS/c1-3-9-22-21(18,19-4-2)20-14-10-16-17(11-14)13-7-5-12(15)6-8-13/h5-8,10-11H,3-4,9H2,1-2H3
40 atoms
Cl -6.634453 -2.091607 -0.382626
S  2.932656 0.689399 -1.210405
P  2.838026 0.214775 0.805186
O  1.794232 1.324885 1.371791
O  4.171557 0.670581 1.524496
O  2.496733 -1.188014 1.116057
N  -1.534279 0.761606 0.432953
N  -1.399287 2.018361 0.010123
C  3.237836 -0.954619 -1.979842
C  2.035111 -1.458466 -2.758036
C  0.501485 1.303781 0.929928
C  -2.748191 0.076733 0.23821
C  -0.406732 0.280161 1.006342
C  -0.164665 2.365036 0.300226
C  0.802628 -1.73619 -1.915368
C  4.87761 1.897554 1.239219
C  -2.752779 -1.302125 0.069217
C  -3.941763 0.787463 0.208599
C  -3.950554 -1.973397 -0.113989
C  -5.137902 0.119833 0.011132
C  6.191911 1.589258 0.570953
C  -5.136523 -1.257635 -0.144093
H  3.541048 -1.660079 -1.207863
H  4.092284 -0.80726 -2.639409
H  1.791787 -0.750281 -3.553727
H  2.356044 -2.377292 -3.258063
H  -0.339988 -0.706908 1.4325
H  0.006431 -2.157305 -2.530185
H  0.415147 -0.823811 -1.461158
H  1.013641 -2.447161 -1.115297
H  0.213827 3.345655 0.054781
H  5.026173 2.391355 2.199044
H  4.272501 2.564911 0.621126
H  -1.82862 -1.865713 0.059729
H  -3.944901 1.860173 0.342495
H  -3.947461 -3.046614 -0.247003
H  -6.064337 0.677359 -0.00992
H  6.740189 2.518465 0.411737
H  6.810756 0.937651 1.188312
H  6.046557 1.115328 -0.400139
elementType: Cl S P O N C H
totalener: -2079.47396255 hartree
nucrepener: 2285.56569530 hartree
electener: -4365.03965785 hartree
oneelecener: -7402.34580567 hartree
twoeener: 3037.30614782 hartree
cpcmener: -0.02842031 hartree
kineticenergy: 2073.52944438 hartree
xcener: -141.818070688857 hartree
chargesum: 0.0000000
charge: -0.092248 -0.196653 0.832338 -0.354454 -0.349078 -0.602034 0.185978 -0.332170 -0.079128 -0.083852 0.127772 0.207131 -0.132293 -0.081782 -0.269405 0.036976 -0.231913 -0.221965 -0.120896 -0.100766 -0.226605 0.067602 0.110038 0.127697 0.068611 0.077005 0.180876 0.101417 0.069781 0.085246 0.158660 0.108111 0.089267 0.146504 0.144507 0.144869 0.144551 0.092609 0.092328 0.075367
qa: -0.0922 -0.1967 0.8323 -0.3545 -0.3491 -0.6020 0.1860 -0.3322 -0.0791 -0.0839 0.1278 0.2071 -0.1323 -0.0818 -0.2694 0.0370 -0.2319 -0.2220 -0.1209 -0.1008 -0.2266 0.0676 0.1100 0.1277 0.0686 0.0770 0.1809 0.1014 0.0698 0.0852 0.1587 0.1081 0.0893 0.1465 0.1445 0.1449 0.1446 0.0926 0.0923 0.0754
va: 1.2114 2.2685 5.4942 2.0891 2.1277 2.0018 3.2865 2.8793 3.8587 3.9124 3.8924 3.6714 3.9255 4.0504 3.9368 3.8750 4.0369 4.0456 4.0028 3.9737 3.9297 3.8672 1.0326 1.0074 1.0110 1.0093 1.0005 1.0074 0.9945 1.0062 1.0017 0.9954 0.9960 1.0004 1.0298 1.0049 1.0045 1.0086 1.0036 1.0119
dispcorr: -0.020503656 hartree
energy: -2079.494466200956
dipole: 31.45265 -30.00712 1.44552 1.38346 -0.76203 0.62143 -9.78802 8.81916 -0.96887
magnitude: 1.84781 au
magnitude: 4.69677 debye
