program: Orca
programVersion: 5.0.2
elementType: Cl S P O O O N N C C C C C C C C C C C C C C H H H H H H H H H H H H H H H H H H
charge: 0
multiplicity: 1
keywords: wb97x-d3
keywords: def2-TZVPP
keywords: def2/J RIJCOSX
keywords: DEFGRID2
keywords: scfconv7
keywords: smallprint printgap noloewdin
keywords: NOSOSCF
formula: C14H18ClN2O3PS
InChI: InChI=1/C14H18ClN2O3PS/c1-3-9-22-21(18,19-4-2)20-14-10-16-17(11-14)13-7-5-12(15)6-8-13/h5-8,10-11H,3-4,9H2,1-2H3
40 atoms
Cl -6.632396 -2.100878 -0.380691
S  2.935339 0.693295 -1.207897
P  2.838473 0.218703 0.807668
O  1.791896 1.327102 1.372752
O  4.17019 0.677105 1.5287
O  2.499251 -1.18468 1.118197
N  -1.534371 0.757519 0.430078
N  -1.397922 2.010759 -0.002783
C  3.238555 -0.951018 -1.977407
C  2.035176 -1.453771 -2.755319
C  0.500196 1.303376 0.927875
C  -2.747787 0.071297 0.23701
C  -0.408401 0.28059 1.010281
C  -0.164007 2.359547 0.287645
C  0.802559 -1.730219 -1.912428
C  4.872781 1.906519 1.245317
C  -2.752345 -1.309055 0.080718
C  -3.940884 0.782249 0.195854
C  -3.949661 -1.981435 -0.101452
C  -5.136491 0.113379 -0.000615
C  6.189136 1.602909 0.57895
C  -5.135123 -1.265443 -0.143202
H  3.541387 -1.656662 -1.205453
H  4.092957 -0.804397 -2.637215
H  1.792423 -0.745429 -3.55104
H  2.355142 -2.372963 -3.255294
H  -0.342695 -0.702993 1.444617
H  0.005913 -2.150825 -2.527008
H  0.415924 -0.817366 -1.458475
H  1.013082 -2.441131 -1.112177
H  0.21533 3.338028 0.035066
H  5.01821 2.400271 2.205652
H  4.266561 2.572342 0.626635
H  -1.828473 -1.873155 0.080274
H  -3.944089 1.856148 0.319796
H  -3.946522 -3.055821 -0.224642
H  -6.062564 0.671097 -0.03075
H  6.809206 0.953104 1.196977
H  6.046903 1.12896 -0.392598
H  6.734521 2.534041 0.421038
elementType: Cl S P O N C H
totalener: -2079.47396397 hartree
nucrepener: 2285.74663069 hartree
electener: -4365.22059466 hartree
oneelecener: -7402.71150951 hartree
twoeener: 3037.49091486 hartree
cpcmener: -0.02842222 hartree
kineticenergy: 2073.52949591 hartree
xcener: -141.818062332887 hartree
chargesum: -0.0000000
charge: -0.092262 -0.196760 0.832395 -0.354642 -0.349092 -0.602063 0.186098 -0.332016 -0.079096 -0.083753 0.127819 0.207565 -0.131960 -0.081622 -0.268914 0.036945 -0.232220 -0.222330 -0.120616 -0.100546 -0.226586 0.067333 0.110060 0.127719 0.068603 0.076994 0.180585 0.101345 0.069354 0.085175 0.158564 0.108105 0.089217 0.146319 0.144515 0.144831 0.144647 0.092327 0.075366 0.092600
qa: -0.0923 -0.1968 0.8324 -0.3546 -0.3491 -0.6021 0.1861 -0.3320 -0.0791 -0.0838 0.1278 0.2076 -0.1320 -0.0816 -0.2689 0.0369 -0.2322 -0.2223 -0.1206 -0.1005 -0.2266 0.0673 0.1101 0.1277 0.0686 0.0770 0.1806 0.1013 0.0694 0.0852 0.1586 0.1081 0.0892 0.1463 0.1445 0.1448 0.1446 0.0923 0.0754 0.0926
va: 1.2114 2.2684 5.4940 2.0887 2.1277 2.0018 3.2866 2.8791 3.8586 3.9120 3.8921 3.6707 3.9266 4.0501 3.9368 3.8751 4.0367 4.0460 4.0025 3.9736 3.9296 3.8674 1.0326 1.0074 1.0110 1.0094 1.0006 1.0075 0.9946 1.0063 1.0018 0.9954 0.9960 1.0006 1.0299 1.0049 1.0045 1.0036 1.0120 1.0085
dispcorr: -0.020511511 hartree
energy: -2079.494475483362
dipole: 31.42823 -29.98898 1.43926 1.45679 -0.82966 0.62713 -9.75962 8.79864 -0.96098
magnitude: 1.84072 au
magnitude: 4.67873 debye
