program: Orca
programVersion: 5.0.2
elementType: Cl S P O O O N N C C C C C C C C C C C C C C H H H H H H H H H H H H H H H H H H
charge: 0
multiplicity: 1
keywords: wb97x-d3
keywords: def2-TZVPP
keywords: def2/J RIJCOSX
keywords: DEFGRID2
keywords: scfconv7
keywords: smallprint printgap noloewdin
keywords: NOSOSCF
formula: C14H18ClN2O3PS
InChI: InChI=1/C14H18ClN2O3PS/c1-3-9-22-21(18,19-4-2)20-14-10-16-17(11-14)13-7-5-12(15)6-8-13/h5-8,10-11H,3-4,9H2,1-2H3
40 atoms
Cl -6.69546 -0.953484 -1.341267
S  2.539847 1.009798 -1.255379
P  3.104526 0.636982 0.707294
O  1.838476 1.082239 1.62522
O  4.031518 1.847486 1.140391
O  3.596214 -0.739331 0.937798
N  -1.300334 -0.318197 0.982831
N  -0.799158 -1.286651 1.752516
C  2.569695 -0.679966 -1.972377
C  1.345748 -1.521808 -1.665993
C  0.689941 0.353123 1.51587
C  -2.588176 -0.456698 0.431429
C  -0.428084 0.702461 0.808653
C  0.409878 -0.898644 2.087628
C  0.064689 -0.990373 -2.284064
C  5.471121 1.804975 1.032131
C  -3.398862 -1.512765 0.833341
C  -3.052265 0.444933 -0.519514
C  -4.661348 -1.666331 0.286968
C  -4.317667 0.295114 -1.061879
C  5.959271 1.986416 -0.383555
C  -5.116878 -0.760996 -0.657536
H  3.489303 -1.166256 -1.652637
H  2.658618 -0.500068 -3.045641
H  1.548138 -2.524344 -2.054517
H  1.233308 -1.636228 -0.58592
H  -0.642566 1.586697 0.233098
H  0.131513 -0.973293 -3.373713
H  -0.154829 0.025127 -1.951644
H  -0.786858 -1.61674 -2.016882
H  1.037039 -1.509039 2.719324
H  5.841585 0.873093 1.462176
H  5.814783 2.621821 1.664618
H  -3.050997 -2.221669 1.570554
H  -2.444127 1.270361 -0.862012
H  -5.281518 -2.493383 0.604952
H  -4.666421 1.002693 -1.801714
H  5.710996 1.138928 -1.022368
H  5.556749 2.893383 -0.835009
H  7.046114 2.0775 -0.36615
elementType: Cl S P O N C H
totalener: -2079.47439524 hartree
nucrepener: 2307.97589913 hartree
electener: -4387.45029437 hartree
oneelecener: -7447.07882124 hartree
twoeener: 3059.62852687 hartree
cpcmener: -0.02797011 hartree
kineticenergy: 2073.53825026 hartree
xcener: -141.821949386045 hartree
chargesum: 0.0000000
charge: -0.093731 -0.187356 0.824559 -0.356934 -0.353100 -0.602317 0.217700 -0.339109 -0.087542 -0.094844 0.129570 0.160221 -0.122596 -0.074292 -0.272622 0.039748 -0.206074 -0.226053 -0.113119 -0.120530 -0.254993 0.069622 0.124296 0.125312 0.089112 0.060699 0.178026 0.100551 0.064235 0.098110 0.157683 0.100927 0.108306 0.148565 0.141530 0.144488 0.144723 0.085610 0.090048 0.101571
qa: -0.0937 -0.1874 0.8246 -0.3569 -0.3531 -0.6023 0.2177 -0.3391 -0.0875 -0.0948 0.1296 0.1602 -0.1226 -0.0743 -0.2726 0.0397 -0.2061 -0.2261 -0.1131 -0.1205 -0.2550 0.0696 0.1243 0.1253 0.0891 0.0607 0.1780 0.1006 0.0642 0.0981 0.1577 0.1009 0.1083 0.1486 0.1415 0.1445 0.1447 0.0856 0.0900 0.1016
va: 1.2100 2.2699 5.4817 2.0992 2.1299 1.9845 3.2794 2.8487 3.8520 3.9006 3.9131 3.7386 3.9514 4.0207 3.9327 3.8577 3.9855 4.0070 3.9915 3.9973 3.9059 3.8582 1.0273 1.0041 1.0110 1.0143 0.9989 1.0046 1.0095 1.0004 1.0060 1.0036 0.9899 1.0388 1.0071 1.0049 1.0043 1.0074 1.0043 1.0098
dispcorr: -0.021958874 hartree
energy: -2079.496354113784
dipole: 27.85287 -27.06013 0.79273 -0.16641 1.22530 1.05889 -9.40732 8.06466 -1.34267
magnitude: 1.88479 au
magnitude: 4.79076 debye
