program: Orca
programVersion: 5.0.2
elementType: Cl S P O O O N N C C C C C C C C C C C C C C H H H H H H H H H H H H H H H H H H
charge: 0
multiplicity: 1
keywords: wb97x-d3
keywords: def2-TZVPP
keywords: def2/J RIJCOSX
keywords: DEFGRID2
keywords: scfconv7
keywords: smallprint printgap noloewdin
keywords: NOSOSCF
formula: C14H18ClN2O3PS
InChI: InChI=1/C14H18ClN2O3PS/c1-3-9-22-21(18,19-4-2)20-14-10-16-17(11-14)13-7-5-12(15)6-8-13/h5-8,10-11H,3-4,9H2,1-2H3
40 atoms
Cl -6.849199 -1.636333 -0.624612
S  2.86704 0.214585 -1.461571
P  3.298176 0.500099 0.550333
O  1.963915 0.166956 1.403138
O  3.313555 2.095061 0.649789
O  4.460944 -0.246599 1.04928
N  -1.400245 0.320474 0.500832
N  -1.094607 1.596007 0.283645
C  3.401217 -1.528133 -1.634776
C  2.414377 -2.537364 -1.072404
C  0.707119 0.482762 0.995396
C  -2.702211 -0.143437 0.24919
C  -0.33509 -0.40093 0.928436
C  0.178747 1.720377 0.581968
C  1.056353 -2.511747 -1.755191
C  4.478364 2.829071 0.236199
C  -3.499002 0.519274 -0.67639
C  -3.195297 -1.256923 0.916348
C  -4.777161 0.061907 -0.938917
C  -4.470899 -1.722382 0.644354
C  5.465334 2.988621 1.369102
C  -5.257845 -1.061622 -0.283955
H  4.383671 -1.62887 -1.176691
H  3.521022 -1.66314 -2.711489
H  2.864373 -3.528187 -1.183538
H  2.307899 -2.381242 0.003584
H  -0.373666 -1.45856 1.124195
H  0.392274 -3.267842 -1.336358
H  1.147768 -2.714872 -2.823546
H  0.569467 -1.542655 -1.643127
H  0.672328 2.674581 0.500527
H  4.105972 3.796604 -0.099335
H  4.945691 2.344177 -0.625981
H  -3.1162 1.391364 -1.186335
H  -2.603234 -1.758432 1.670136
H  -5.396234 0.576481 -1.660314
H  -4.853365 -2.588059 1.166606
H  5.861765 2.026184 1.687784
H  6.300268 3.607904 1.039605
H  5.004959 3.476712 2.227542
totalener: -2079.45013335 hartree
nucrepener: 2275.16164309 hartree
electener: -4354.61177644 hartree
oneelecener: -7380.75519285 hartree
twoeener: 3026.14341642 hartree
kineticenergy: 2073.57750850 hartree
xcener: -141.823331774415 hartree
chargesum: -0.0000000
charge: -0.072994 -0.178182 0.774785 -0.324077 -0.335907 -0.510159 0.183240 -0.301196 -0.110051 -0.114953 0.121193 0.164491 -0.143477 -0.045756 -0.263203 0.030538 -0.174288 -0.211060 -0.085494 -0.097748 -0.234315 0.058156 0.135072 0.107900 0.078680 0.066985 0.147936 0.088980 0.086757 0.088143 0.133859 0.091824 0.081412 0.132841 0.122456 0.123540 0.122362 0.098530 0.080190 0.082993
qa: -0.0730 -0.1782 0.7748 -0.3241 -0.3359 -0.5102 0.1832 -0.3012 -0.1101 -0.1150 0.1212 0.1645 -0.1435 -0.0458 -0.2632 0.0305 -0.1743 -0.2111 -0.0855 -0.0977 -0.2343 0.0582 0.1351 0.1079 0.0787 0.0670 0.1479 0.0890 0.0868 0.0881 0.1339 0.0918 0.0814 0.1328 0.1225 0.1235 0.1224 0.0985 0.0802 0.0830
va: 1.2321 2.2660 5.5075 2.1143 2.1085 2.1273 3.3083 2.8924 3.8894 3.8737 3.9711 3.8142 3.9402 4.0311 3.9274 3.8960 4.0403 4.0568 3.9808 4.0103 3.9244 3.9566 1.0250 1.0048 1.0124 1.0235 1.0020 1.0055 1.0078 0.9993 1.0161 0.9914 1.0072 1.0373 1.0108 1.0115 1.0125 1.0204 1.0098 1.0058
dispcorr: -0.019920917 hartree
energy: -2079.470054263008
dipole: 29.64198 -29.42546 0.21652 -0.28565 0.18315 -0.10249 -4.20784 3.55629 -0.65155
magnitude: 0.69420 au
magnitude: 1.76451 debye
