program: Orca
programVersion: 5.0.2
elementType: Cl S P O O O N N C C C C C C C C C C C C C C H H H H H H H H H H H H H H H H H H
charge: 0
multiplicity: 1
keywords: wb97x-d3
keywords: def2-TZVPP
keywords: def2/J RIJCOSX
keywords: DEFGRID2
keywords: scfconv7
keywords: smallprint printgap noloewdin
keywords: NOSOSCF
formula: C14H18ClN2O3PS
InChI: InChI=1/C14H18ClN2O3PS/c1-3-9-22-21(18,19-4-2)20-14-10-16-17(11-14)13-7-5-12(15)6-8-13/h5-8,10-11H,3-4,9H2,1-2H3
40 atoms
Cl -6.956517 -0.407313 1.435871
S  4.602761 -0.426177 -0.704117
P  2.777219 0.176652 0.033124
O  1.87098 0.183803 -1.320282
O  3.069494 1.718951 0.305554
O  2.170648 -0.582113 1.144698
N  -1.55832 0.604844 -0.722809
N  -1.368216 1.58646 -1.601343
C  4.24173 -2.181757 -1.088229
C  4.321298 -3.103897 0.116071
C  0.552935 0.51583 -1.212693
C  -2.839289 0.37333 -0.193593
C  -0.418888 -0.080357 -0.454149
C  -0.091893 1.553045 -1.907705
C  4.110689 -4.55782 -0.286878
C  2.795239 2.326196 1.57956
C  -3.001103 -0.37954 0.962594
C  -3.953624 0.900939 -0.83525
C  -4.2688 -0.624321 1.462307
C  -5.218809 0.665761 -0.328884
C  1.34726 2.739403 1.700828
C  -5.37525 -0.102376 0.814257
H  4.995772 -2.44719 -1.831765
H  3.275267 -2.247098 -1.590005
H  5.296567 -2.986666 0.59281
H  3.575894 -2.804624 0.853218
H  -0.370003 -0.922548 0.21271
H  3.132475 -4.708662 -0.746025
H  4.169447 -5.214389 0.580805
H  4.865485 -4.890226 -1.001556
H  0.330459 2.254144 -2.610092
H  3.454225 3.192605 1.625371
H  3.073942 1.648483 2.388784
H  -2.14724 -0.769557 1.499488
H  -3.826864 1.494515 -1.728623
H  -4.389317 -1.211682 2.361613
H  -6.084109 1.07557 -0.830763
H  0.686111 1.873477 1.708779
H  1.199303 3.280371 2.636054
H  1.050037 3.394206 0.882164
totalener: -2079.45094052 hartree
nucrepener: 2241.84555896 hartree
electener: -4321.29649948 hartree
oneelecener: -7314.36355330 hartree
twoeener: 2993.06705382 hartree
kineticenergy: 2073.57842010 hartree
xcener: -141.820934806748 hartree
chargesum: -0.0000000
charge: -0.074823 -0.137551 0.776065 -0.338464 -0.338055 -0.528482 0.181119 -0.295704 -0.119428 -0.090415 0.103934 0.160883 -0.088086 -0.078123 -0.249197 0.037485 -0.210366 -0.173814 -0.104824 -0.089547 -0.248264 0.058771 0.113193 0.104368 0.058038 0.080836 0.152489 0.077495 0.089654 0.073208 0.132221 0.095463 0.091580 0.122910 0.136480 0.122203 0.122346 0.093450 0.091948 0.089001
qa: -0.0748 -0.1376 0.7761 -0.3385 -0.3381 -0.5285 0.1811 -0.2957 -0.1194 -0.0904 0.1039 0.1609 -0.0881 -0.0781 -0.2492 0.0375 -0.2104 -0.1738 -0.1048 -0.0895 -0.2483 0.0588 0.1132 0.1044 0.0580 0.0808 0.1525 0.0775 0.0897 0.0732 0.1322 0.0955 0.0916 0.1229 0.1365 0.1222 0.1223 0.0935 0.0919 0.0890
va: 1.2304 2.3126 5.5122 2.0902 2.1206 2.0554 3.3021 2.8646 3.9059 3.8717 3.9832 3.8534 3.9333 4.0454 3.9486 3.8802 4.0535 4.0195 4.0197 3.9885 3.9080 3.9512 1.0050 1.0228 1.0155 1.0320 1.0141 1.0035 1.0063 1.0029 1.0074 0.9913 1.0046 1.0118 1.0393 1.0126 1.0117 1.0064 1.0137 1.0071
dispcorr: -0.018667828 hartree
energy: -2079.469608344115
dipole: 28.18751 -27.53181 0.65570 -8.76124 8.56313 -0.19811 2.42624 -2.31414 0.11210
magnitude: 0.69409 au
magnitude: 1.76424 debye
