program: Orca
programVersion: 5.0.2
elementType: Cl S P O O O N N C C C C C C C C C C C C C C H H H H H H H H H H H H H H H H H H
charge: 0
multiplicity: 1
keywords: wb97x-d3
keywords: def2-TZVPP
keywords: def2/J RIJCOSX
keywords: DEFGRID2
keywords: scfconv7
keywords: smallprint printgap noloewdin
keywords: NOSOSCF
formula: C14H18ClN2O3PS
InChI: InChI=1/C14H18ClN2O3PS/c1-3-9-22-21(18,19-4-2)20-14-10-16-17(11-14)13-7-5-12(15)6-8-13/h5-8,10-11H,3-4,9H2,1-2H3
40 atoms
Cl -6.886847 -1.985226 0.193312
S  2.767931 0.966589 -1.496022
P  2.663639 0.310198 0.473394
O  1.689572 1.372516 1.202678
O  3.993925 0.817114 1.181152
O  2.295184 -1.113538 0.598484
N  -1.721456 0.834471 0.610262
N  -1.663185 2.144827 0.386619
C  2.427619 -0.582068 -2.409997
C  3.628023 -1.503496 -2.538077
C  0.360005 1.360851 0.910856
C  -2.947896 0.157711 0.505584
C  -0.515045 0.307772 0.938216
C  -0.406596 2.483468 0.557686
C  4.805031 -0.885914 -3.275833
C  5.253784 0.203758 0.890024
C  -2.980044 -1.209308 0.263048
C  -4.136617 0.863571 0.646687
C  -4.192565 -1.872094 0.176345
C  -5.347693 0.20344 0.548229
C  5.501125 -1.016763 1.747651
C  -5.373501 -1.163201 0.316773
H  2.094573 -0.237395 -3.391013
H  1.588342 -1.085003 -1.934665
H  3.927435 -1.842961 -1.54442
H  3.29226 -2.398843 -3.069703
H  -0.364518 -0.726541 1.193252
H  5.179096 0.002062 -2.765147
H  4.527116 -0.587885 -4.28819
H  5.629676 -1.593531 -3.356624
H  -0.083388 3.504036 0.428761
H  5.999295 0.974385 1.083725
H  5.318022 -0.043179 -0.175233
H  -2.065722 -1.768497 0.117084
H  -4.109554 1.927807 0.82984
H  -4.214446 -2.935695 -0.014814
H  -6.271683 0.75342 0.659086
H  6.501352 -1.403278 1.549296
H  5.442242 -0.769815 2.807155
H  4.783042 -1.807967 1.538768
totalener: -2079.45217847 hartree
nucrepener: 2244.12037665 hartree
electener: -4323.57255512 hartree
oneelecener: -7318.81858015 hartree
twoeener: 2995.24602503 hartree
kineticenergy: 2073.58823376 hartree
xcener: -141.825394443744 hartree
chargesum: 0.0000000
charge: -0.074867 -0.172104 0.787133 -0.329047 -0.310731 -0.527437 0.159053 -0.297055 -0.089871 -0.136502 0.080204 0.169579 -0.079409 -0.060440 -0.235961 0.036361 -0.206510 -0.178271 -0.104420 -0.086667 -0.234673 0.058641 0.114473 0.117257 0.072609 0.076219 0.161917 0.070096 0.080503 0.090035 0.128377 0.101495 0.056890 0.120822 0.133577 0.121744 0.122554 0.081250 0.090246 0.092929
qa: -0.0749 -0.1721 0.7871 -0.3290 -0.3107 -0.5274 0.1591 -0.2971 -0.0899 -0.1365 0.0802 0.1696 -0.0794 -0.0604 -0.2360 0.0364 -0.2065 -0.1783 -0.1044 -0.0867 -0.2347 0.0586 0.1145 0.1173 0.0726 0.0762 0.1619 0.0701 0.0805 0.0900 0.1284 0.1015 0.0569 0.1208 0.1336 0.1217 0.1226 0.0813 0.0902 0.0929
va: 1.2304 2.2825 5.5331 2.1513 2.1496 2.0581 3.3228 2.8798 3.8674 3.9202 4.0149 3.8277 3.9391 4.0463 3.9106 3.9262 4.0509 4.0338 4.0185 3.9822 3.9181 3.9539 1.0058 1.0292 1.0164 1.0121 1.0079 1.0161 1.0043 1.0061 1.0086 0.9934 1.0007 1.0128 1.0376 1.0128 1.0115 1.0091 1.0077 1.0186
dispcorr: -0.018802321 hartree
energy: -2079.470980792771
dipole: 41.85298 -40.60761 1.24537 -6.50520 6.10965 -0.39554 -10.93993 10.38046 -0.55948
magnitude: 1.42141 au
magnitude: 3.61295 debye
