program: Orca
programVersion: 5.0.2
elementType: Cl S P O O O N N C C C C C C C C C C C C C C H H H H H H H H H H H H H H H H H H
charge: 0
multiplicity: 1
keywords: wb97x-d3
keywords: def2-TZVPP
keywords: def2/J RIJCOSX
keywords: DEFGRID2
keywords: scfconv7
keywords: smallprint printgap noloewdin
keywords: NOSOSCF
formula: C14H18ClN2O3PS
InChI: InChI=1/C14H18ClN2O3PS/c1-3-9-22-21(18,19-4-2)20-14-10-16-17(11-14)13-7-5-12(15)6-8-13/h5-8,10-11H,3-4,9H2,1-2H3
40 atoms
Cl -7.073038 1.741991 0.055561
S  4.402376 -0.475966 1.115142
P  2.606192 -0.13162 0.151665
O  1.67895 -1.05303 1.113544
O  2.631904 -0.972571 -1.209083
O  2.206226 1.281352 -0.003349
N  -1.751169 -0.767467 0.477164
N  -1.607946 -2.073743 0.266938
C  5.241377 1.108434 0.744016
C  5.70328 1.269539 -0.694009
C  0.354799 -1.159374 0.809133
C  -3.016641 -0.167777 0.360666
C  -0.584987 -0.164023 0.81343
C  -0.334052 -2.331541 0.458026
C  6.643218 0.175683 -1.172346
C  2.262979 -0.407848 -2.474763
C  -4.161328 -0.939927 0.514804
C  -3.128397 1.191304 0.098607
C  -5.409174 -0.35205 0.414832
C  -4.377566 1.782022 0.011707
C  0.769367 -0.441039 -2.699118
C  -5.514892 1.00837 0.169966
H  6.094498 1.10675 1.425287
H  4.582001 1.921043 1.043622
H  4.83264 1.34067 -1.349948
H  6.201385 2.241222 -0.761383
H  -0.500316 0.881196 1.054683
H  6.154619 -0.798275 -1.170909
H  7.525522 0.104447 -0.534141
H  6.986949 0.374446 -2.187026
H  0.054286 -3.331287 0.346159
H  2.779833 -1.017404 -3.215449
H  2.640725 0.613101 -2.560236
H  -4.071974 -1.998368 0.711535
H  -2.249077 1.8008 -0.060901
H  -6.299246 -0.953091 0.537276
H  -4.46148 2.840121 -0.192227
H  0.369369 -1.446887 -2.575811
H  0.248387 0.223604 -2.011347
H  0.545847 -0.111455 -3.714425
totalener: -2079.44928764 hartree
nucrepener: 2251.82402647 hartree
electener: -4331.27331411 hartree
oneelecener: -7334.27192503 hartree
twoeener: 3002.99861092 hartree
kineticenergy: 2073.59054339 hartree
xcener: -141.823868773067 hartree
chargesum: 0.0000000
charge: -0.073382 -0.150554 0.779487 -0.341490 -0.322142 -0.527212 0.181520 -0.290110 -0.128470 -0.119122 0.101576 0.171625 -0.105469 -0.086068 -0.238107 0.038094 -0.179111 -0.209686 -0.086905 -0.102070 -0.251608 0.057484 0.113650 0.130256 0.064871 0.075607 0.156823 0.081795 0.076273 0.086397 0.131882 0.097559 0.087534 0.133743 0.122465 0.122996 0.122479 0.092548 0.089638 0.095203
qa: -0.0734 -0.1506 0.7795 -0.3415 -0.3221 -0.5272 0.1815 -0.2901 -0.1285 -0.1191 0.1016 0.1716 -0.1055 -0.0861 -0.2381 0.0381 -0.1791 -0.2097 -0.0869 -0.1021 -0.2516 0.0575 0.1136 0.1303 0.0649 0.0756 0.1568 0.0818 0.0763 0.0864 0.1319 0.0976 0.0875 0.1337 0.1225 0.1230 0.1225 0.0925 0.0896 0.0952
va: 1.2318 2.2885 5.4984 2.1328 2.0853 2.0589 3.2925 2.8590 3.9024 3.8965 3.9911 3.8158 3.9442 4.0407 3.9213 3.8773 4.0426 4.0547 3.9848 4.0175 3.9277 3.9559 1.0035 1.0250 1.0184 1.0090 1.0094 1.0169 1.0041 1.0066 1.0084 0.9896 0.9997 1.0373 1.0111 1.0115 1.0125 1.0069 1.0056 1.0135
dispcorr: -0.019873504 hartree
energy: -2079.469161147272
dipole: 36.87768 -36.03215 0.84553 1.26566 -0.97182 0.29384 -14.68326 14.03994 -0.64332
magnitude: 1.10233 au
magnitude: 2.80189 debye
