program: Orca
programVersion: 5.0.2
elementType: Cl S P O O O N N C C C C C C C C C C C C C C H H H H H H H H H H H H H H H H H H
charge: 0
multiplicity: 1
keywords: wb97x-d3
keywords: def2-TZVPP
keywords: def2/J RIJCOSX
keywords: DEFGRID2
keywords: scfconv7
keywords: smallprint printgap noloewdin
keywords: NOSOSCF
formula: C14H18ClN2O3PS
InChI: InChI=1/C14H18ClN2O3PS/c1-3-9-22-21(18,19-4-2)20-14-10-16-17(11-14)13-7-5-12(15)6-8-13/h5-8,10-11H,3-4,9H2,1-2H3
40 atoms
Cl -6.673615 -1.171787 1.308378
S  3.670689 -0.868859 -0.820786
P  2.896353 0.870296 -0.016466
O  1.86363 1.468575 -1.132408
O  4.11131 1.871046 -0.227287
O  2.291325 0.738845 1.323025
N  -1.385788 0.178868 -0.93533
N  -1.09166 -0.168596 -2.18626
C  3.066347 -2.095327 0.39468
C  1.619538 -2.504586 0.19124
C  0.63629 0.896437 -1.254851
C  -2.640723 -0.147187 -0.393895
C  -0.36699 0.832942 -0.324655
C  0.133631 0.252782 -2.398016
C  1.217577 -3.60997 1.158461
C  3.997215 3.272817 0.076959
C  -3.699814 -0.444625 -1.243371
C  -2.829515 -0.177816 0.981817
C  -4.938563 -0.764149 -0.718139
C  -4.073413 -0.484686 1.506789
C  4.214852 3.553301 1.54681
C  -5.124894 -0.778312 0.655446
H  3.237351 -1.706492 1.39763
H  3.735545 -2.946736 0.254051
H  0.975188 -1.636105 0.336331
H  1.472376 -2.831933 -0.839938
H  -0.417323 1.211918 0.680602
H  0.17494 -3.891582 1.014995
H  1.333498 -3.291962 2.195433
H  1.822725 -4.506894 1.017684
H  0.621376 0.091714 -3.346037
H  3.030863 3.658274 -0.257054
H  4.764108 3.755577 -0.527753
H  -3.549819 -0.428953 -2.312887
H  -2.010418 0.014084 1.661425
H  -5.760657 -0.99564 -1.380815
H  -4.215829 -0.508055 2.577929
H  4.194776 4.630752 1.715189
H  3.440106 3.099694 2.162571
H  5.182515 3.180537 1.880617
totalener: -2079.45210135 hartree
nucrepener: 2274.57784492 hartree
electener: -4354.02994627 hartree
oneelecener: -7379.88173672 hartree
twoeener: 3025.85179045 hartree
kineticenergy: 2073.58161655 hartree
xcener: -141.822074869333 hartree
chargesum: 0.0000000
charge: -0.074334 -0.148660 0.796342 -0.352174 -0.329719 -0.532349 0.183844 -0.292809 -0.096674 -0.083262 0.111402 0.161553 -0.103637 -0.071571 -0.257574 0.012007 -0.178935 -0.208001 -0.086684 -0.103741 -0.230669 0.058391 0.112933 0.110839 0.062546 0.068824 0.148369 0.090411 0.081923 0.076689 0.127860 0.088973 0.096228 0.135248 0.123088 0.122715 0.122245 0.080791 0.092653 0.084920
qa: -0.0743 -0.1487 0.7963 -0.3522 -0.3297 -0.5323 0.1838 -0.2928 -0.0967 -0.0833 0.1114 0.1616 -0.1036 -0.0716 -0.2576 0.0120 -0.1789 -0.2080 -0.0867 -0.1037 -0.2307 0.0584 0.1129 0.1108 0.0625 0.0688 0.1484 0.0904 0.0819 0.0767 0.1279 0.0890 0.0962 0.1352 0.1231 0.1227 0.1222 0.0808 0.0927 0.0849
va: 1.2310 2.3016 5.4865 2.0842 2.1602 2.0606 3.2953 2.8648 3.8757 3.9053 3.9739 3.8406 3.9337 4.0475 3.9648 3.9272 4.0330 4.0515 3.9859 4.0165 3.9046 3.9528 1.0280 1.0082 1.0035 1.0165 1.0156 1.0057 1.0016 1.0042 1.0110 1.0007 0.9899 1.0392 1.0111 1.0116 1.0127 1.0100 1.0209 1.0061
dispcorr: -0.019418825 hartree
energy: -2079.471520176190
dipole: 24.06291 -23.52230 0.54061 -1.76170 2.12543 0.36372 6.56756 -6.39258 0.17497
magnitude: 0.67467 au
magnitude: 1.71486 debye
