program: Orca
programVersion: 5.0.2
elementType: Cl S P O O O N N C C C C C C C C C C C C C C H H H H H H H H H H H H H H H H H H
charge: 0
multiplicity: 1
keywords: wb97x-d3
keywords: def2-TZVPP
keywords: def2/J RIJCOSX
keywords: DEFGRID2
keywords: scfconv7
keywords: smallprint printgap noloewdin
keywords: NOSOSCF
formula: C14H18ClN2O3PS
InChI: InChI=1/C14H18ClN2O3PS/c1-3-9-22-21(18,19-4-2)20-14-10-16-17(11-14)13-7-5-12(15)6-8-13/h5-8,10-11H,3-4,9H2,1-2H3
40 atoms
Cl -6.863708 -1.588385 1.006339
S  3.443979 -0.377098 -0.331866
P  2.591773 1.385764 0.372826
O  1.541416 1.859082 -0.765833
O  3.66791 2.510178 0.052657
O  2.054912 1.273969 1.739995
N  -1.505971 0.138559 -0.764914
N  -1.043834 -0.247364 -1.952544
C  3.005293 -1.544488 1.010783
C  1.578731 -2.060611 0.958353
C  0.425066 1.106429 -0.957059
C  -2.771183 -0.292409 -0.330708
C  -0.64787 0.96659 -0.119275
C  0.129744 0.324939 -2.086685
C  1.250188 -2.851732 -0.29632
C  4.922008 2.546233 0.743833
C  -3.674568 -0.808861 -1.252253
C  -3.12895 -0.199733 1.008103
C  -4.929281 -1.215533 -0.837078
C  -4.389808 -0.595446 1.420909
C  5.993156 2.970904 -0.230208
C  -5.289039 -1.099442 0.496397
H  3.217272 -1.062595 1.962902
H  3.719069 -2.361321 0.88477
H  1.437127 -2.69307 1.840055
H  0.889408 -1.223164 1.076174
H  -0.846132 1.407006 0.841915
H  1.900252 -3.722765 -0.397482
H  1.363369 -2.243594 -1.193276
H  0.220774 -3.207207 -0.273704
H  0.727711 0.169306 -2.970478
H  5.162919 1.564292 1.16205
H  4.834674 3.248372 1.57428
H  -3.392473 -0.89069 -2.291584
H  -2.430781 0.16476 1.749185
H  -5.630902 -1.613791 -1.55649
H  -4.664335 -0.517093 2.463375
H  6.101035 2.243636 -1.034293
H  5.767948 3.941369 -0.671063
H  6.950793 3.04929 0.284364
totalener: -2079.45217170 hartree
nucrepener: 2282.72424814 hartree
electener: -4362.17641984 hartree
oneelecener: -7396.08504576 hartree
twoeener: 3033.90862592 hartree
kineticenergy: 2073.59741990 hartree
xcener: -141.826573491344 hartree
chargesum: -0.0000000
charge: -0.073872 -0.189278 0.772395 -0.325769 -0.317957 -0.513165 0.195523 -0.290686 -0.103487 -0.117653 0.120135 0.159764 -0.107926 -0.095907 -0.243366 0.008054 -0.179250 -0.209800 -0.088233 -0.102517 -0.215269 0.058586 0.123200 0.111942 0.076682 0.074643 0.153568 0.081161 0.078481 0.090226 0.135117 0.076453 0.104200 0.137719 0.120415 0.122928 0.122307 0.082978 0.090484 0.077172
qa: -0.0739 -0.1893 0.7724 -0.3258 -0.3180 -0.5132 0.1955 -0.2907 -0.1035 -0.1177 0.1201 0.1598 -0.1079 -0.0959 -0.2434 0.0081 -0.1792 -0.2098 -0.0882 -0.1025 -0.2153 0.0586 0.1232 0.1119 0.0767 0.0746 0.1536 0.0812 0.0785 0.0902 0.1351 0.0765 0.1042 0.1377 0.1204 0.1229 0.1223 0.0830 0.0905 0.0772
va: 1.2313 2.2684 5.5417 2.1337 2.1484 2.0869 3.2920 2.8476 3.8799 3.9152 3.9629 3.8377 3.9346 4.0245 3.9162 3.8997 4.0272 4.0570 3.9878 4.0184 3.9384 3.9518 1.0281 1.0056 1.0114 1.0098 1.0108 1.0054 1.0161 1.0085 1.0093 1.0034 0.9981 1.0393 1.0130 1.0118 1.0125 1.0092 1.0061 1.0103
dispcorr: -0.020385023 hartree
energy: -2079.472556724763
dipole: 32.15811 -31.06801 1.09010 -3.60353 3.43603 -0.16750 1.04388 -0.81201 0.23188
magnitude: 1.12700 au
magnitude: 2.86461 debye
