program: Gaussian 09
title: 000066530
version: EM64L-G09RevD.01
frameworkgroup: C1[X(C16H10ClNO3)]
method: RPBEPBE
basis: SDD
operation: Freq
keyword: #p
keyword: freq=noraman
keyword: PBEPBE/SDD
title: #p freq=noraman PBEPBE/SDD
converged: NO YES NO NO
title: Mulliken charges:
elementType: Cl O O O N C C C C C C C C C C C C C C C C H H H H H H H H H H
charge: -0.039858 -0.178113 -0.196417 -0.230885 -0.442498 0.308096 0.292304 0.263176 0.276908 -0.225991 -0.210864 -0.502754 -0.403807 0.687046 -0.451971 -0.371277 -0.370868 -0.226787 -0.225404 0.223069 -0.794589 0.363563 0.310307 0.292333 0.291106 0.241988 0.241621 0.321692 0.244323 0.272589 0.241965
chargesum: 0.00000
title: Mulliken charges with hydrogens summed into heavy atoms:
elementType: Cl O O O N C C C C C C C C C C C C C C C C
charge: -0.039858 -0.178113 -0.196417 -0.230885 -0.120807 0.308096 0.292304 0.263176 0.276908 -0.225991 -0.210864 -0.139190 -0.093500 0.687046 -0.451971 -0.078944 -0.079763 0.015201 0.016216 0.223069 -0.035712
polarizability: 3.60155959e+02 3.20640111e-01 2.31531856e+02 -5.44146854e-02 1.31831581e-02 7.78795720e+01
1716.lowfreq: -41.4138 -8.5959 -0.0017 0.0013 0.0015 4.3978 8.2231 36.7576 45.2156
frequency: -41.4014 36.7454 45.2068 65.3491 95.8031 96.3255 123.8936 146.6240 161.7558 192.0909 223.8003 229.7482 257.5051 269.1414 297.0474 344.6411 370.8632 420.7540 425.5803 442.9090 444.5933 453.8014 457.6002 492.6032 568.0444 570.0049 595.3282 628.2957 648.4251 683.0329 687.7509 688.8154 709.5813 729.8058 746.9040 767.2883 809.6142 846.3696 866.9549 924.3552 933.1438 939.0075 949.7193 971.6411 986.9154 1000.0215 1013.8668 1016.9255 1034.9378 1035.4421 1082.9623 1120.1956 1154.3721 1173.4784 1216.0197 1218.3564 1228.1494 1254.8178 1283.0962 1312.8221 1372.9684 1379.7795 1396.4075 1419.5167 1440.0137 1443.5036 1465.3447 1467.1026 1469.0730 1500.1026 1538.9537 1546.2678 1563.1799 1592.2668 1599.2381 1617.3458 1645.6259 2990.2492 3075.5545 3137.4945 3139.0904 3151.5388 3161.8493 3166.6183 3171.8331 3181.4972 3477.5713
redmass: 1.0503 6.4704 9.8866 5.0531 5.8066 7.2063 4.8566 6.4615 9.9689 6.0419 8.8072 5.1962 6.0787 7.1841 8.9056 6.3056 10.8451 5.5020 3.8420 6.8658 4.3921 3.5149 12.4172 7.4013 3.8424 5.1809 4.0604 6.8353 6.4514 6.7370 1.9599 7.4781 2.1562 2.4145 3.2368 6.0481 1.8014 6.2488 2.2500 1.4051 6.2106 6.2963 1.9109 2.2762 1.5429 1.4049 2.4294 1.3778 1.6784 1.9079 2.9426 3.0222 1.9534 1.1053 2.8973 2.2737 1.3567 2.5649 2.1409 5.0467 5.5083 1.2539 9.5262 6.0431 1.8704 1.8009 1.9203 1.0563 2.6693 3.4731 5.6907 10.0663 5.3845 7.5360 7.3955 7.5615 5.2835 1.0384 1.0982 1.0863 1.0982 1.0901 1.0947 1.0926 1.1005 1.0925 1.0764
irintensity: 0.4386 1.5819 5.4871 6.1115 3.8815 3.7615 0.1816 1.6785 1.7708 0.0019 0.3372 0.0040 1.0653 1.3157 0.6721 0.7058 22.2728 14.6619 6.7544 0.5718 0.1110 5.2269 4.3224 23.2118 1.7049 8.0043 0.6227 7.0869 9.8235 1.2887 33.3723 11.7608 13.1523 85.5078 27.1341 27.8482 22.4005 1.3777 0.2413 5.4596 0.2248 39.9195 14.6638 72.5186 19.8754 9.3939 26.3780 0.1230 8.6135 2.1791 6.0644 21.2486 15.3961 25.8445 126.1300 127.2964 19.5139 28.5339 27.7691 787.3183 351.8626 95.1094 16.8749 3.5891 79.5308 28.7241 9.8132 20.8680 17.0821 346.9379 21.9409 295.7259 160.8421 5.0027 48.4100 17.8339 85.5146 4.5861 11.4184 3.7318 6.1193 4.4700 1.5527 7.1910 31.7869 17.9010 45.0894
temp: 298.150 k
press: 1.00000 atm
elementType: 17 8 8 8 7 6 6 6 6 6 6 6 6 6 6 6 6 6 6 6 6 1 1 1 1 1 1 1 1 1 1
symmnumber: 1
zpe: 577801.3 jmol-1
zpe.correction: 0.220073 hartree
zpe.thermalcorrener: 0.236852 hartree
zpe.thermalcorrenthalpy: 0.237796 hartree
zpe.thermalcorrgfe: 0.174662 hartree
zpe.sumelectzpe: -1354.792767 hartree
zpe.sumelectthermal: -1354.775989 hartree
zpe.sumelectthermalent: -1354.775044 hartree
zpe.sumelectthermalfe: -1354.838179 hartree
dipole: -1.3613 1.2739 0.0124
dipole: 1.8644
quadrupole: -81.0637 -147.4881 -128.8552
quadrupole: -9.1453 -0.0556 -0.0248
quadrupole: 38.0720 -28.3525 -9.7195 -9.1453 -0.0556 -0.0248
hfenergy: -1355.0128402 hartree
pointgroup: C01 [X(C16H10Cl1N1O3)]
dipole: 0.5074009 -0.5296795 0.0047539 debye
polarizability: 359.8071432|-6.6969026|231.8806822|-0.0093947|-0.0088789|77.8795612 unknown
InChI: InChI=1S/C16H10ClNO3/c1-8(19)18-14-7-12-11(6-13(14)17)15(20)9-4-2-3-5-10(9)16(12)21/h2-7,18H,1H3
charge 0 multiplicity 1
31 atoms
Cl 3.361483 -2.97524 -0.001871
O  -0.672096 2.57872 -0.000527
O  -2.025331 -2.779623 -0.000138
O  3.796599 2.351835 -0.004226
N  3.830366 0.000994 -0.00236
C  0.068833 0.278409 -0.000827
C  -0.294142 -1.100237 -0.000611
C  -2.413436 0.905358 0.000042
C  -2.76541 -0.477392 0.000182
C  -0.983347 1.346698 -0.000525
C  -1.717373 -1.543814 -0.000048
C  1.425728 0.666602 -0.001441
C  0.726127 -2.082391 -0.000943
C  2.457299 -0.308943 -0.001778
C  2.062322 -1.684663 -0.001511
C  -3.434133 1.887873 0.000382
C  -4.130802 -0.854343 0.000611
C  -4.790322 1.504588 0.000825
C  -5.139545 0.129958 0.000924
C  4.443604 1.269951 -0.002611
C  5.968201 1.203687 0.001632
H  1.686174 1.72741 -0.001887
H  0.439678 -3.138181 -0.000767
H  -3.135113 2.940902 0.000247
H  -4.370174 -1.92249 0.0007
H  -5.575026 2.26848 0.001079
H  -6.193779 -0.166808 0.001267
H  4.456457 -0.811636 -0.002089
H  6.342727 0.704014 0.914191
H  6.3634 2.22887 -0.028234
H  6.34923 0.647515 -0.874688
