program: Orca
programVersion: 5.0.2
elementType: Cl S P O O O N N C C C C C C C C C C C C C C H H H H H H H H H H H H H H H H H H
charge: 0
multiplicity: 1
keywords: wb97x-d3
keywords: def2-TZVPP
keywords: def2/J RIJCOSX
keywords: DEFGRID2
keywords: scfconv7
keywords: smallprint printgap noloewdin
keywords: NOSOSCF
formula: C14H18ClN2O3PS
InChI: InChI=1/C14H18ClN2O3PS/c1-3-9-22-21(18,19-4-2)20-14-10-16-17(11-14)13-7-5-12(15)6-8-13/h5-8,10-11H,3-4,9H2,1-2H3
40 atoms
Cl -6.566684 -1.348792 1.645453
S  3.723248 -0.651891 -0.690322
P  2.764585 1.162754 -0.358252
O  1.690253 1.349743 -1.557512
O  3.795582 2.24363 -0.903275
O  2.221612 1.301038 1.006285
N  -1.384748 -0.205291 -0.940019
N  -1.01524 -0.889567 -2.021231
C  3.144812 -1.639588 0.736107
C  1.74406 -2.201914 0.574914
C  0.544817 0.616982 -1.491875
C  -2.611823 -0.487328 -0.314375
C  -0.469551 0.726698 -0.578531
C  0.15668 -0.409205 -2.368687
C  1.38273 -3.134757 1.722651
C  4.935345 2.60897 -0.112466
C  -3.604535 -1.161081 -1.016251
C  -2.839921 -0.097222 0.999116
C  -4.818105 -1.431043 -0.409908
C  -4.059372 -0.356451 1.601251
C  4.600145 3.682672 0.898192
C  -5.046773 -1.022241 0.894855
H  3.233194 -1.034946 1.637642
H  3.879971 -2.444236 0.804709
H  1.029145 -1.379235 0.533566
H  1.666799 -2.729416 -0.377817
H  -0.59192 1.394457 0.255711
H  1.421609 -2.619421 2.683246
H  2.060929 -3.98797 1.776552
H  0.373212 -3.525634 1.600283
H  0.686988 -0.799505 -3.222507
H  5.675975 2.963786 -0.828227
H  5.355419 1.724263 0.375851
H  -3.423554 -1.473764 -2.034236
H  -2.069127 0.394491 1.576739
H  -5.588845 -1.953919 -0.958675
H  -4.232235 -0.049645 2.623196
H  3.89763 3.323946 1.64785
H  5.510471 3.996858 1.409444
H  4.171032 4.558239 0.412459
totalener: -2079.45303684 hartree
nucrepener: 2278.15429050 hartree
electener: -4357.60732735 hartree
oneelecener: -7386.95472836 hartree
twoeener: 3029.34740101 hartree
kineticenergy: 2073.58143717 hartree
xcener: -141.823167157423 hartree
chargesum: 0.0000000
charge: -0.073841 -0.175473 0.781282 -0.322544 -0.324047 -0.526494 0.179055 -0.292629 -0.093272 -0.081069 0.086440 0.159775 -0.076742 -0.070935 -0.257724 0.032564 -0.180162 -0.207179 -0.086985 -0.102205 -0.240468 0.058666 0.114032 0.108913 0.058560 0.069010 0.145158 0.080933 0.077060 0.092230 0.130069 0.097358 0.072709 0.136266 0.124022 0.122933 0.122239 0.095653 0.080734 0.086111
qa: -0.0738 -0.1755 0.7813 -0.3225 -0.3240 -0.5265 0.1791 -0.2926 -0.0933 -0.0811 0.0864 0.1598 -0.0767 -0.0709 -0.2577 0.0326 -0.1802 -0.2072 -0.0870 -0.1022 -0.2405 0.0587 0.1140 0.1089 0.0586 0.0690 0.1452 0.0809 0.0771 0.0922 0.1301 0.0974 0.0727 0.1363 0.1240 0.1229 0.1222 0.0957 0.0807 0.0861
va: 1.2313 2.2928 5.5258 2.1327 2.1528 2.0661 3.3008 2.8567 3.8779 3.9026 3.9967 3.8409 3.9204 4.0344 3.9675 3.9052 4.0351 4.0528 3.9861 4.0153 3.9201 3.9535 1.0274 1.0067 1.0061 1.0171 1.0146 1.0016 1.0040 1.0055 1.0117 0.9905 1.0100 1.0388 1.0108 1.0115 1.0126 1.0204 1.0096 1.0052
dispcorr: -0.019753364 hartree
energy: -2079.472790208289
dipole: 27.89672 -26.95836 0.93836 -1.53801 1.53742 -0.00059 8.04793 -7.67072 0.37722
magnitude: 1.01134 au
magnitude: 2.57063 debye
