program: Orca
programVersion: 5.0.2
elementType: Cl S P O O O N N C C C C C C C C C C C C C C H H H H H H H H H H H H H H H H H H
charge: 0
multiplicity: 1
keywords: wb97x-d3
keywords: def2-TZVPP
keywords: def2/J RIJCOSX
keywords: DEFGRID2
keywords: scfconv7
keywords: smallprint printgap noloewdin
keywords: NOSOSCF
formula: C14H18ClN2O3PS
InChI: InChI=1/C14H18ClN2O3PS/c1-3-9-22-21(18,19-4-2)20-14-10-16-17(11-14)13-7-5-12(15)6-8-13/h5-8,10-11H,3-4,9H2,1-2H3
40 atoms
Cl -6.32683 -2.412683 0.491325
S  3.28078 0.589397 -1.733055
P  3.063711 0.380325 0.31326
O  2.022429 1.569609 0.694457
O  4.407759 0.994728 0.897328
O  2.67456 -0.958917 0.798074
N  -1.342194 0.726194 0.202886
N  -1.336458 1.932774 -0.358636
C  3.348278 -1.161324 -2.280228
C  2.120066 -1.565599 -3.080711
C  0.701589 1.420304 0.398644
C  -2.526882 -0.026631 0.247768
C  -0.127725 0.369401 0.687951
C  -0.101794 2.368897 -0.255429
C  0.822843 -1.52609 -2.290033
C  4.817725 0.754862 2.253899
C  -3.756173 0.619553 0.21376
C  -2.474734 -1.411959 0.328972
C  -4.925023 -0.117034 0.278062
C  -3.6446 -2.148216 0.407429
C  4.146335 1.690579 3.233915
C  -4.866992 -1.497963 0.385965
H  3.470982 -1.797434 -1.404721
H  4.252157 -1.245459 -2.88319
H  2.035019 -0.936919 -3.970496
H  2.302228 -2.581664 -3.4449
H  0.058938 -0.558756 1.198501
H  -0.000518 -1.933996 -2.875933
H  0.557081 -0.506061 -2.01446
H  0.9053 -2.107026 -1.370079
H  0.181215 3.334584 -0.643065
H  5.895775 0.91093 2.251559
H  4.632625 -0.288432 2.517519
H  -3.794129 1.696475 0.136582
H  -1.526507 -1.932397 0.309838
H  -5.881172 0.386671 0.254678
H  -3.60125 -3.226311 0.471441
H  4.293736 2.731769 2.950283
H  3.076088 1.504931 3.311655
H  4.58031 1.546468 4.223924
totalener: -2079.45073865 hartree
nucrepener: 2286.81531932 hartree
electener: -4366.26605797 hartree
oneelecener: -7404.42506355 hartree
twoeener: 3038.15900558 hartree
kineticenergy: 2073.58676882 hartree
xcener: -141.824297175056 hartree
chargesum: 0.0000000
charge: -0.074646 -0.153848 0.803490 -0.344462 -0.328798 -0.533914 0.181302 -0.292810 -0.109811 -0.092141 0.119839 0.185190 -0.127122 -0.070939 -0.257633 0.009483 -0.181728 -0.207604 -0.085158 -0.111604 -0.227861 0.060503 0.107732 0.118675 0.068539 0.068038 0.161665 0.096259 0.080416 0.079335 0.126480 0.095556 0.094185 0.132057 0.112916 0.122330 0.121304 0.088157 0.082445 0.084184
qa: -0.0746 -0.1538 0.8035 -0.3445 -0.3288 -0.5339 0.1813 -0.2928 -0.1098 -0.0921 0.1198 0.1852 -0.1271 -0.0709 -0.2576 0.0095 -0.1817 -0.2076 -0.0852 -0.1116 -0.2279 0.0605 0.1077 0.1187 0.0685 0.0680 0.1617 0.0963 0.0804 0.0793 0.1265 0.0956 0.0942 0.1321 0.1129 0.1223 0.1213 0.0882 0.0824 0.0842
va: 1.2307 2.2870 5.4965 2.1028 2.1532 2.0545 3.2884 2.8705 3.8775 3.9063 3.9509 3.7900 3.9339 4.0520 3.9382 3.9196 4.0481 4.0527 3.9837 4.0341 3.9119 3.9511 1.0371 1.0078 1.0104 1.0096 1.0119 1.0082 1.0030 1.0052 1.0099 0.9881 1.0038 1.0377 1.0154 1.0117 1.0130 1.0063 1.0153 1.0106
dispcorr: -0.020308776 hartree
energy: -2079.471047421479
dipole: 24.75886 -23.83901 0.91985 -0.80638 0.60421 -0.20217 -2.30340 2.46976 0.16636
magnitude: 0.95639 au
magnitude: 2.43095 debye
