program: Orca
programVersion: 5.0.2
elementType: Cl S P O O O N N C C C C C C C C C C C C C C H H H H H H H H H H H H H H H H H H
charge: 0
multiplicity: 1
keywords: wb97x-d3
keywords: def2-TZVPP
keywords: def2/J RIJCOSX
keywords: DEFGRID2
keywords: scfconv7
keywords: smallprint printgap noloewdin
keywords: NOSOSCF
formula: C14H18ClN2O3PS
InChI: InChI=1/C14H18ClN2O3PS/c1-3-9-22-21(18,19-4-2)20-14-10-16-17(11-14)13-7-5-12(15)6-8-13/h5-8,10-11H,3-4,9H2,1-2H3
40 atoms
Cl -6.537897 -1.817501 0.067958
S  3.295427 -0.45734 -1.048309
P  2.956603 0.355571 0.838844
O  2.027758 1.661024 0.518976
O  4.294207 1.07396 1.28956
O  2.415509 -0.590442 1.825764
N  -1.263371 0.797768 -0.308781
N  -0.978367 1.573497 -1.351826
C  2.746227 -2.187753 -0.791639
C  1.240786 -2.386166 -0.783642
C  0.778575 1.449719 0.021722
C  -2.515992 0.16705 -0.221933
C  -0.229584 0.696185 0.562069
C  0.259346 1.975365 -1.172987
C  0.531841 -1.904325 -2.038115
C  4.961243 2.093555 0.535804
C  -2.671225 -0.984931 0.53831
C  -3.602989 0.696203 -0.907072
C  -3.911283 -1.59341 0.634053
C  -4.838415 0.080529 -0.822048
C  4.757208 3.448121 1.174028
C  -4.992153 -1.058058 -0.045889
H  3.200353 -2.560665 0.124025
H  3.203512 -2.718857 -1.628789
H  1.068849 -3.458936 -0.651163
H  0.822709 -1.904049 0.100566
H  -0.276329 0.144132 1.484563
H  0.924749 -2.393348 -2.931432
H  0.640769 -0.828586 -2.173718
H  -0.535027 -2.121392 -1.987488
H  0.741711 2.61911 -1.891155
H  4.625467 2.10053 -0.50546
H  6.016501 1.820508 0.528734
H  -1.828009 -1.434193 1.04577
H  -3.477956 1.585502 -1.507499
H  -4.028422 -2.489958 1.22633
H  -5.683831 0.492939 -1.354799
H  5.324108 4.199754 0.623757
H  3.708708 3.741556 1.16397
H  5.107873 3.452851 2.205504
totalener: -2079.44990575 hartree
nucrepener: 2315.55361880 hartree
electener: -4395.00352454 hartree
oneelecener: -7461.56681421 hartree
twoeener: 3066.56328967 hartree
kineticenergy: 2073.57454150 hartree
xcener: -141.823908748164 hartree
chargesum: -0.0000000
charge: -0.072969 -0.199991 0.792351 -0.348805 -0.321561 -0.511170 0.200166 -0.289313 -0.099130 -0.118089 0.148860 0.177344 -0.158241 -0.082990 -0.250705 0.027492 -0.210282 -0.194467 -0.106234 -0.081339 -0.236854 0.060374 0.126879 0.114711 0.079863 0.067669 0.172827 0.086739 0.083832 0.087677 0.122413 0.081291 0.098963 0.113467 0.133712 0.122507 0.122702 0.081151 0.088490 0.090659
qa: -0.0730 -0.2000 0.7924 -0.3488 -0.3216 -0.5112 0.2002 -0.2893 -0.0991 -0.1181 0.1489 0.1773 -0.1582 -0.0830 -0.2507 0.0275 -0.2103 -0.1945 -0.1062 -0.0813 -0.2369 0.0604 0.1269 0.1147 0.0799 0.0677 0.1728 0.0867 0.0838 0.0877 0.1224 0.0813 0.0990 0.1135 0.1337 0.1225 0.1227 0.0812 0.0885 0.0907
va: 1.2323 2.2510 5.5062 2.0880 2.1570 2.1052 3.2804 2.8569 3.8968 3.8743 3.9141 3.7813 3.9451 4.0465 3.9151 3.8974 4.0414 4.0616 4.0400 3.9802 3.9278 3.9555 1.0241 1.0052 1.0106 1.0248 1.0033 1.0084 1.0115 1.0078 1.0128 0.9972 0.9948 1.0154 1.0385 1.0131 1.0119 1.0095 1.0146 1.0051
dispcorr: -0.021760779 hartree
energy: -2079.471666525310
dipole: 24.35425 -23.61235 0.74190 2.18361 -1.89662 0.28700 -5.84987 5.26538 -0.58449
magnitude: 0.98712 au
magnitude: 2.50906 debye
