program: Orca
programVersion: 5.0.2
elementType: Cl S P O O O N N C C C C C C C C C C C C C C H H H H H H H H H H H H H H H H H H
charge: 0
multiplicity: 1
keywords: wb97x-d3
keywords: def2-TZVPP
keywords: def2/J RIJCOSX
keywords: DEFGRID2
keywords: scfconv7
keywords: smallprint printgap noloewdin
keywords: NOSOSCF
formula: C14H18ClN2O3PS
InChI: InChI=1/C14H18ClN2O3PS/c1-3-9-22-21(18,19-4-2)20-14-10-16-17(11-14)13-7-5-12(15)6-8-13/h5-8,10-11H,3-4,9H2,1-2H3
40 atoms
Cl -6.817518 -0.785248 1.401809
S  3.631458 -0.687624 -0.273795
P  2.764255 1.196604 -0.118246
O  1.74936 1.31966 -1.378162
O  3.85619 2.200101 -0.690316
O  2.179981 1.47995 1.206033
N  -1.40869 -0.092501 -0.853495
N  -1.005488 -0.851635 -1.870543
C  2.948636 -1.516587 1.211562
C  1.548814 -2.077221 1.034244
C  0.582442 0.623036 -1.331956
C  -2.688796 -0.274906 -0.30211
C  -0.478323 0.823466 -0.489385
C  0.20315 -0.436092 -2.173199
C  1.436283 -3.13168 -0.053193
C  4.698833 2.955141 0.190644
C  -3.669651 -0.928382 -1.038654
C  -2.982045 0.20066 0.969531
C  -4.93732 -1.091045 -0.509833
C  -4.254586 0.048568 1.493214
C  5.786452 2.117914 0.82551
C  -5.230134 -0.595494 0.751164
H  2.995187 -0.81554 2.042551
H  3.664654 -2.316472 1.410655
H  1.251263 -2.507048 1.99559
H  0.853255 -1.258202 0.843787
H  -0.623137 1.545721 0.294516
H  1.733069 -2.733989 -1.023305
H  0.410445 -3.485239 -0.147263
H  2.06948 -3.99403 0.163028
H  0.764229 -0.892512 -2.972926
H  4.09004 3.443303 0.954327
H  5.129971 3.73238 -0.4389
H  -3.438454 -1.306455 -2.023746
H  -2.223675 0.678371 1.574792
H  -5.699884 -1.596429 -1.085758
H  -4.479184 0.422364 2.482219
H  6.462144 2.768988 1.380863
H  5.381708 1.387788 1.52575
H  6.369273 1.585327 0.075283
totalener: -2079.45122750 hartree
nucrepener: 2290.88042940 hartree
electener: -4370.33165690 hartree
oneelecener: -7412.46674160 hartree
twoeener: 3042.13508471 hartree
kineticenergy: 2073.59362422 hartree
xcener: -141.827142711235 hartree
chargesum: -0.0000000
charge: -0.073747 -0.171799 0.779350 -0.326085 -0.330361 -0.524521 0.180527 -0.289878 -0.111068 -0.106681 0.098749 0.160460 -0.077707 -0.098849 -0.247296 0.026516 -0.180647 -0.209077 -0.087614 -0.101170 -0.252313 0.058796 0.124494 0.112608 0.077819 0.067122 0.146159 0.071855 0.095860 0.082925 0.137660 0.096254 0.095781 0.136383 0.125070 0.123012 0.122475 0.088358 0.087875 0.092704
qa: -0.0737 -0.1718 0.7793 -0.3261 -0.3304 -0.5245 0.1805 -0.2899 -0.1111 -0.1067 0.0987 0.1605 -0.0777 -0.0988 -0.2473 0.0265 -0.1806 -0.2091 -0.0876 -0.1012 -0.2523 0.0588 0.1245 0.1126 0.0778 0.0671 0.1462 0.0719 0.0959 0.0829 0.1377 0.0963 0.0958 0.1364 0.1251 0.1230 0.1225 0.0884 0.0879 0.0927
va: 1.2314 2.2726 5.5183 2.1316 2.1462 2.0670 3.3062 2.8471 3.8816 3.9331 3.9757 3.8359 3.9245 4.0227 3.9238 3.8968 4.0374 4.0585 3.9856 4.0148 3.9086 3.9533 1.0284 1.0049 1.0120 1.0006 1.0143 1.0183 1.0091 1.0049 1.0072 1.0034 0.9894 1.0384 1.0104 1.0116 1.0126 1.0123 1.0093 1.0049
dispcorr: -0.020844090 hartree
energy: -2079.472071589392
dipole: 30.20654 -29.32602 0.88052 -5.30952 5.39004 0.08052 4.84631 -4.40742 0.43889
magnitude: 0.98713 au
magnitude: 2.50907 debye
