program: Orca
programVersion: 5.0.2
elementType: Cl S P O O O N N C C C C C C C C C C C C C C H H H H H H H H H H H H H H H H H H
charge: 0
multiplicity: 1
keywords: wb97x-d3
keywords: def2-TZVPP
keywords: def2/J RIJCOSX
keywords: DEFGRID2
keywords: scfconv7
keywords: smallprint printgap noloewdin
keywords: NOSOSCF
formula: C14H18ClN2O3PS
InChI: InChI=1/C14H18ClN2O3PS/c1-3-9-22-21(18,19-4-2)20-14-10-16-17(11-14)13-7-5-12(15)6-8-13/h5-8,10-11H,3-4,9H2,1-2H3
40 atoms
Cl -6.438448 -2.113861 0.599015
S  3.299021 -0.366511 -0.836621
P  2.765011 1.154618 0.478745
O  1.756783 2.092008 -0.377464
O  3.968198 2.192975 0.492091
O  2.268997 0.664065 1.778775
N  -1.402996 0.637165 -0.774916
N  -1.131253 0.912216 -2.048521
C  2.834894 -1.861257 0.116966
C  1.348576 -2.170348 0.163112
C  0.55779 1.562933 -0.742094
C  -2.60035 -0.015689 -0.43814
C  -0.40898 1.021381 0.062809
C  0.057241 1.470427 -2.051416
C  0.69582 -2.332125 -1.199258
C  4.994271 2.118238 1.490648
C  -2.72784 -0.674224 0.778033
C  -3.661039 -0.011272 -1.335777
C  -3.912683 -1.312791 1.10311
C  -4.839546 -0.659557 -1.015891
C  5.940727 0.955276 1.284927
C  -4.965202 -1.306013 0.203531
H  3.249488 -1.774407 1.119915
H  3.37887 -2.657031 -0.396398
H  1.238466 -3.095471 0.737861
H  0.842372 -1.395898 0.740126
H  -0.451594 0.917184 1.1328
H  1.169671 -3.128616 -1.776426
H  0.75802 -1.415611 -1.785021
H  -0.359434 -2.583867 -1.09535
H  0.52025 1.78837 -2.972007
H  4.539796 2.076716 2.482487
H  5.528618 3.063565 1.408113
H  -1.904003 -0.719133 1.477444
H  -3.558259 0.493796 -2.284486
H  -4.006356 -1.825218 2.049998
H  -5.663199 -0.655834 -1.715939
H  5.456471 -0.004785 1.461808
H  6.35292 0.947602 0.276702
H  6.769282 1.039771 1.989053
totalener: -2079.45085753 hartree
nucrepener: 2315.37395262 hartree
electener: -4394.82481014 hartree
oneelecener: -7461.35490132 hartree
twoeener: 3066.53009118 hartree
kineticenergy: 2073.59353966 hartree
xcener: -141.828440091770 hartree
chargesum: 0.0000000
charge: -0.074210 -0.167424 0.779132 -0.325095 -0.324917 -0.523924 0.204118 -0.290262 -0.111021 -0.119668 0.117613 0.163269 -0.147868 -0.075311 -0.249704 0.026262 -0.204176 -0.188561 -0.107956 -0.083500 -0.252678 0.061138 0.118372 0.116679 0.080350 0.070271 0.171485 0.086978 0.082999 0.087940 0.127630 0.098039 0.095746 0.111150 0.135624 0.122089 0.122622 0.082625 0.094329 0.089813
qa: -0.0742 -0.1674 0.7791 -0.3251 -0.3249 -0.5239 0.2041 -0.2903 -0.1110 -0.1197 0.1176 0.1633 -0.1479 -0.0753 -0.2497 0.0263 -0.2042 -0.1886 -0.1080 -0.0835 -0.2527 0.0611 0.1184 0.1167 0.0804 0.0703 0.1715 0.0870 0.0830 0.0879 0.1276 0.0980 0.0957 0.1112 0.1356 0.1221 0.1226 0.0826 0.0943 0.0898
va: 1.2309 2.2733 5.5195 2.1441 2.1499 2.0635 3.2785 2.8529 3.8935 3.8878 3.9619 3.8052 3.9147 4.0348 3.9165 3.8928 4.0409 4.0455 4.0403 3.9837 3.9109 3.9515 1.0230 1.0051 1.0093 1.0211 1.0041 1.0082 1.0137 1.0079 1.0110 1.0028 0.9900 1.0172 1.0401 1.0131 1.0119 1.0070 1.0056 1.0126
dispcorr: -0.022005586 hartree
energy: -2079.472863111668
dipole: 28.59508 -27.56047 1.03462 -6.57396 6.21625 -0.35772 2.13470 -1.80788 0.32682
magnitude: 1.14246 au
magnitude: 2.90390 debye
