program: Orca
programVersion: 5.0.2
elementType: Cl S P O O O N N C C C C C C C C C C C C C C H H H H H H H H H H H H H H H H H H
charge: 0
multiplicity: 1
keywords: wb97x-d3
keywords: def2-TZVPP
keywords: def2/J RIJCOSX
keywords: DEFGRID2
keywords: scfconv7
keywords: smallprint printgap noloewdin
keywords: NOSOSCF
formula: C14H18ClN2O3PS
InChI: InChI=1/C14H18ClN2O3PS/c1-3-9-22-21(18,19-4-2)20-14-10-16-17(11-14)13-7-5-12(15)6-8-13/h5-8,10-11H,3-4,9H2,1-2H3
40 atoms
Cl -6.796264 -0.596953 -1.04407
S  2.693857 0.796604 -1.282622
P  3.23145 0.340954 0.685654
O  1.953343 0.835222 1.573762
O  4.293626 1.431889 1.124963
O  3.640142 -1.053848 0.894634
N  -1.244606 -0.428748 0.951977
N  -0.749254 -1.464726 1.627654
C  2.713967 -0.882032 -2.02452
C  1.449387 -1.684018 -1.775743
C  0.788682 0.144147 1.44845
C  -2.561567 -0.471732 0.464704
C  -0.344439 0.575127 0.81479
C  0.484267 -1.139295 1.937704
C  0.200689 -1.06842 -2.383002
C  4.135732 2.8384 0.893772
C  -2.960206 0.366863 -0.568606
C  -3.472464 -1.363613 1.019279
C  -4.264775 0.332713 -1.03077
C  -4.772288 -1.406276 0.548626
C  5.199773 3.331466 -0.058263
C  -5.169448 -0.552836 -0.469276
H  3.596042 -1.40118 -1.656422
H  2.856822 -0.693346 -3.090191
H  1.612538 -2.678477 -2.201333
H  1.319435 -1.837133 -0.703703
H  -0.560173 1.505925 0.320172
H  0.031504 -0.06164 -1.999559
H  -0.681947 -1.662934 -2.149066
H  0.2773 -1.000709 -3.469658
H  1.120129 -1.81672 2.484659
H  4.218647 3.325958 1.865855
H  3.139005 3.069355 0.505395
H  -2.258424 1.039505 -1.043046
H  -3.159923 -2.023628 1.815324
H  -4.568921 0.987152 -1.835529
H  -5.478508 -2.100612 0.982321
H  5.105868 4.410268 -0.185206
H  6.198393 3.123239 0.324065
H  5.098685 2.864749 -1.037539
totalener: -2079.44858134 hartree
nucrepener: 2306.64536243 hartree
electener: -4386.09394378 hartree
oneelecener: -7443.65596324 hartree
twoeener: 3057.56201946 hartree
kineticenergy: 2073.57316862 hartree
xcener: -141.822865163384 hartree
chargesum: -0.0000000
charge: -0.072520 -0.218032 0.787816 -0.346212 -0.319668 -0.501001 0.202158 -0.292751 -0.104441 -0.101247 0.135913 0.176402 -0.143116 -0.063076 -0.250916 0.008331 -0.209018 -0.189656 -0.110191 -0.082905 -0.209256 0.057718 0.133205 0.111529 0.079698 0.080224 0.146273 0.050640 0.100019 0.088914 0.142226 0.100540 0.075665 0.106423 0.137069 0.121181 0.123841 0.077829 0.092454 0.077938
qa: -0.0725 -0.2180 0.7878 -0.3462 -0.3197 -0.5010 0.2022 -0.2928 -0.1044 -0.1012 0.1359 0.1764 -0.1431 -0.0631 -0.2509 0.0083 -0.2090 -0.1897 -0.1102 -0.0829 -0.2093 0.0577 0.1332 0.1115 0.0797 0.0802 0.1463 0.0506 0.1000 0.0889 0.1422 0.1005 0.0757 0.1064 0.1371 0.1212 0.1238 0.0778 0.0925 0.0779
va: 1.2327 2.2397 5.5128 2.0809 2.1488 2.1256 3.2810 2.8573 3.8968 3.8898 3.9440 3.7819 3.9716 4.0298 3.9179 3.9168 4.0425 4.0468 4.0477 3.9797 3.9150 3.9595 1.0268 1.0046 1.0141 1.0202 1.0090 1.0178 1.0034 1.0078 1.0123 0.9953 0.9961 1.0126 1.0385 1.0129 1.0112 1.0111 1.0051 1.0200
dispcorr: -0.021575353 hartree
energy: -2079.470156697541
dipole: 23.42788 -23.48852 -0.06064 5.17182 -3.83732 1.33450 -9.95759 9.12396 -0.83363
magnitude: 1.57464 au
magnitude: 4.00242 debye
