program: Orca
programVersion: 5.0.2
elementType: Cl S P O O O N N C C C C C C C C C C C C C C H H H H H H H H H H H H H H H H H H
charge: 0
multiplicity: 1
keywords: wb97x-d3
keywords: def2-TZVPP
keywords: def2/J RIJCOSX
keywords: DEFGRID2
keywords: scfconv7
keywords: smallprint printgap noloewdin
keywords: NOSOSCF
formula: C14H18ClN2O3PS
InChI: InChI=1/C14H18ClN2O3PS/c1-3-9-22-21(18,19-4-2)20-14-10-16-17(11-14)13-7-5-12(15)6-8-13/h5-8,10-11H,3-4,9H2,1-2H3
40 atoms
Cl -6.772625 -0.595747 -1.096523
S  2.704696 0.7487 -1.300318
P  3.23793 0.344092 0.679837
O  1.960892 0.86708 1.55286
O  4.304781 1.441282 1.091527
O  3.642301 -1.045589 0.926601
N  -1.243086 -0.392351 0.955269
N  -0.759867 -1.409022 1.667624
C  2.722174 -0.950864 -1.993368
C  1.457043 -1.744325 -1.720871
C  0.791727 0.18105 1.444088
C  -2.555604 -0.443187 0.456981
C  -0.334656 0.59953 0.790313
C  0.474463 -1.082724 1.974354
C  0.209316 -1.146422 -2.347498
C  4.148464 2.8445 0.839388
C  -2.936175 0.359295 -0.610949
C  -3.478965 -1.307364 1.033522
C  -4.235366 0.317113 -1.087153
C  -4.773506 -1.358473 0.549231
C  5.218519 3.321467 -0.113134
C  -5.152487 -0.541007 -0.504346
H  3.604546 -1.460529 -1.612667
H  2.863006 -0.792541 -3.064344
H  1.619655 -2.751613 -2.116019
H  1.32629 -1.864917 -0.644599
H  -0.540093 1.514783 0.263454
H  0.286678 -1.11237 -3.43573
H  0.041952 -0.127903 -1.995598
H  -0.674458 -1.731703 -2.095663
H  1.101569 -1.746338 2.547684
H  4.226094 3.346054 1.804679
H  3.154226 3.069757 0.441745
H  -2.224239 1.008873 -1.101634
H  -3.180948 -1.939933 1.856838
H  -4.525077 0.943089 -1.919282
H  -5.489598 -2.031329 0.999865
H  6.214572 3.115676 0.277327
H  5.121476 2.84228 -1.086756
H  5.128856 4.398871 -0.255027
totalener: -2079.44859884 hartree
nucrepener: 2307.07522773 hartree
electener: -4386.52382656 hartree
oneelecener: -7444.51441472 hartree
twoeener: 3057.99058815 hartree
kineticenergy: 2073.57824735 hartree
xcener: -141.823764100474 hartree
chargesum: 0.0000000
charge: -0.072460 -0.217912 0.787015 -0.346529 -0.319518 -0.500851 0.201499 -0.292425 -0.103642 -0.101593 0.135626 0.177929 -0.142928 -0.062430 -0.250373 0.008533 -0.209300 -0.190384 -0.110839 -0.082494 -0.208993 0.057956 0.132969 0.111407 0.079826 0.080256 0.146495 0.088949 0.049650 0.100378 0.141617 0.100544 0.075537 0.106312 0.137079 0.121165 0.123832 0.092360 0.077925 0.077811
qa: -0.0725 -0.2179 0.7870 -0.3465 -0.3195 -0.5009 0.2015 -0.2924 -0.1036 -0.1016 0.1356 0.1779 -0.1429 -0.0624 -0.2504 0.0085 -0.2093 -0.1904 -0.1108 -0.0825 -0.2090 0.0580 0.1330 0.1114 0.0798 0.0803 0.1465 0.0889 0.0497 0.1004 0.1416 0.1005 0.0755 0.1063 0.1371 0.1212 0.1238 0.0924 0.0779 0.0778
va: 1.2328 2.2397 5.5142 2.0801 2.1487 2.1259 3.2819 2.8579 3.8967 3.8891 3.9432 3.7784 3.9717 4.0312 3.9177 3.9163 4.0426 4.0484 4.0492 3.9788 3.9160 3.9591 1.0268 1.0045 1.0142 1.0204 1.0088 1.0080 1.0178 1.0033 1.0122 0.9953 0.9960 1.0123 1.0383 1.0130 1.0113 1.0052 1.0195 1.0110
dispcorr: -0.021600524 hartree
energy: -2079.470199361720
dipole: 23.43184 -23.48967 -0.05783 4.79681 -3.48461 1.31220 -9.78938 8.92893 -0.86045
magnitude: 1.57022 au
magnitude: 3.99119 debye
