program: Orca
programVersion: 5.0.2
elementType: Cl Cl S S P O O C C C C C C C C C C C H H H H H H H H H H H H H H H
charge: 0
multiplicity: 1
keywords: wb97x-d3
keywords: def2-TZVPP
keywords: def2/J RIJCOSX
keywords: DEFGRID2
keywords: scfconv7
keywords: smallprint printgap noloewdin
keywords: NOSOSCF
formula: C11H15Cl2O2PS2
InChI: InChI=1/C11H15Cl2O2PS2/c1-3-7-18-16(17,14-4-2)15-11-6-5-9(12)8-10(11)13/h5-6,8H,3-4,7H2,1-2H3
33 atoms
Cl -1.348972 -1.749911 1.384172
Cl -5.336497 1.429944 -0.289936
S  3.01918 -0.913784 -0.305816
S  1.084281 1.150696 1.648154
P  1.44773 0.40735 -0.085907
O  0.202337 -0.43233 -0.73696
O  1.753389 1.437324 -1.269763
C  2.782098 -2.036736 1.124404
C  2.055527 -3.317757 0.762563
C  2.830006 -4.20242 -0.198344
C  -1.0815 0.037145 -0.61787
C  2.369628 2.726055 -1.045753
C  -1.927169 -0.512904 0.33841
C  -1.55642 1.021516 -1.468547
C  3.849677 2.618791 -0.780588
C  -3.242016 -0.089005 0.444779
C  -2.867783 1.456043 -1.373714
C  -3.696564 0.897676 -0.414659
H  2.271457 -1.480293 1.910936
H  3.790923 -2.246073 1.482564
H  1.879627 -3.858933 1.696303
H  1.072257 -3.083032 0.352872
H  3.003628 -3.707584 -1.154941
H  3.80137 -4.478016 0.214842
H  2.284745 -5.123445 -0.404192
H  2.175396 3.283616 -1.959975
H  1.856383 3.230693 -0.226032
H  -0.905731 1.44236 -2.222835
H  4.365259 2.090082 -1.581922
H  4.267588 3.624201 -0.72062
H  4.063573 2.117302 0.163451
H  -3.894613 -0.522387 1.18977
H  -3.231409 2.221266 -2.044505
elementType: Cl S P O C H
totalener: -2636.99701329 hartree
nucrepener: 2138.63689632 hartree
electener: -4775.63390961 hartree
oneelecener: -7889.72041777 hartree
twoeener: 3114.08650816 hartree
cpcmener: -0.01681202 hartree
kineticenergy: 2631.02417022 hartree
xcener: -154.152669229915 hartree
chargesum: 0.0000000
charge: -0.064099 -0.083443 -0.150460 -0.424525 0.634343 -0.351016 -0.361246 -0.086643 -0.092691 -0.258072 0.216351 0.043902 0.013349 -0.165583 -0.244312 -0.099158 -0.131064 0.060444 0.114694 0.129085 0.080496 0.044888 0.073296 0.086734 0.092247 0.110234 0.095688 0.161074 0.092236 0.103347 0.076551 0.133367 0.149986
qa: -0.0641 -0.0834 -0.1505 -0.4245 0.6343 -0.3510 -0.3612 -0.0866 -0.0927 -0.2581 0.2164 0.0439 0.0133 -0.1656 -0.2443 -0.0992 -0.1311 0.0604 0.1147 0.1291 0.0805 0.0449 0.0733 0.0867 0.0922 0.1102 0.0957 0.1611 0.0922 0.1033 0.0766 0.1334 0.1500
va: 1.2456 1.2170 2.3140 2.0223 5.3944 2.0904 2.1097 3.8398 3.8881 3.9428 3.7868 3.8410 3.9915 4.0235 3.9035 4.0031 3.9886 3.8768 1.0391 1.0042 1.0078 1.0385 1.0142 1.0009 1.0042 0.9908 1.0131 1.0017 1.0037 1.0105 1.0174 1.0135 1.0005
dispcorr: -0.018150693 hartree
energy: -2637.015163984721
dipole: 32.98009 -32.06285 0.91724 -6.06312 6.24861 0.18549 -4.71038 3.91571 -0.79467
magnitude: 1.22769 au
magnitude: 3.12055 debye
